/home/lula/Projects/K21/201809Boca/csd_boca_201809/UnitTests/SalesSystem/src/main/java/br/com/k21/CommissionCalculator.java
/home/lula/Projects/K21/201809Boca/csd_boca_201809/UnitTests/SalesSystem/src/main/java/br/com/k21/Application.java
/home/lula/Projects/K21/201809Boca/csd_boca_201809/UnitTests/SalesSystem/src/main/java/br/com/k21/CalculatorController.java
