{
  "name":"KINT",
  "slug":"KINT",
  "lastModified":"2020-04-03T07:09:42Z",
  "phoneNumber":"+44 114 273 8271",
  "emailAddress":"info@k-int.co.uk",
  "contactName":"Contact Name",
  "foafUrl":"https://raw.githubusercontent.com/openlibraryenvironment/mod-directory/master/seed_data/KnowInt.json",
  "url":"https://www.k-int.com",
  "type":"Institution",
  "description": "K-Int test institution",
  "addresses": [
    {
      "addressLabel":"K-Int office", "tags":["DefaultAddress","ShippingAddress"], "lines":[
        { "seq":1, "type":"AdministrativeArea", "value":"Sheffield"},
        { "seq":2, "type":"Thoroughfare", "value":"35 Paradise Street"},
        { "seq":3, "type":"Department", "value":"Sheffield"},
        { "seq":4, "type":"Country", "value":"UK"}
      ]
    }
  ],
  "symbols": [
    { "authority":"RESHARE",   "symbol":"KNOWINT01",    "priority":"a" }
  ],
  "services":[
    {
      "slug":"knowint_ISO18626",
      "service":{ "name":"K-Int ISO18626 Service", "address": "https://iso18626-reshare.apps.k-int.com/rs/iso18626", "type":"ISO18626", "businessFunction":"ILL" },
      "customProperties":{ "ILLPreferredNamespaces":["RESHARE"] }
    }
  ]

}
