{
  "name":"Fictional test Consortium",
  "slug":"CARDINAL",
  "foafUrl":"https://gitlab.com/knowledge-integration/reshare/bootstrap_directory/-/raw/master/fictional_cons.json",
  "url":"http://not.a.real.consortium/",
  "type":"Consortium",
  "members":[
    { "memberOrg":"KINT"},
    { "memberOrg":"unseen"}
  ],
  "friends":[
    { "foaf": "https://gitlab.com/knowledge-integration/reshare/bootstrap_directory/-/raw/master/KnowInt.json" },
    { "foaf": "https://gitlab.com/knowledge-integration/reshare/bootstrap_directory/-/raw/master/unseen.json" }
  ]
}
