{
  "name":"The Unseen University",
  "slug":"unseen",
  "lastModified":"2020-04-03T07:09:42Z",
  "phoneNumber":"+44 114 273 8271",
  "emailAddress":"info@k-int.co.uk",
  "contactName":"Rincewind",
  "foafUrl":"https://gitlab.com/knowledge-integration/reshare/bootstrap_directory/-/raw/master/unseen.json",
  "url":"http://wiki.lspace.org/mediawiki/index.php/Unseen_University",
  "type":"Institution",
  "description": "A fictional university located in the discword universe - Nunc id Vides, Nunc ne Vides",
  "addresses": [
    {
      "addressLabel":"The Unseen University", "tags":["DefaultAddress","ShippingAddress"], "lines":[
        { "seq":1, "type":"AdministrativeArea", "value":"Ankh-Morpork"}
      ]
    }
  ],
  "units": [
    { "name":"The Library",  "slug":"unseen_main", "type": "Branch", "lmsLocationCode":"MAIN" },
    { "name":"Tower of Art", "slug":"unseen_art",  "type": "Branch", "lmsLocationCode":"ART" }
  ],
  "symbols": [
    { "authority":"RESHARE",   "symbol":"UNSEEN",    "priority":"a" }
  ],
  "services":[
    {
      "slug":"unseen_ISO18626",
      "service":{ "name":"Unseen University ISO18626 Service", "address": "https://okapi-reshare-dev.libsdev.k-int.com/rs/iso18626", "type":"ISO18626", "businessFunction":"ILL" },
      "customProperties":{ "ILLPreferredNamespaces":["RESHARE"] }
    }
  ]
}
