module gitlab.com/knopkalab/go/process

go 1.17

require github.com/elastic/go-sysinfo v1.7.1

require (
	github.com/elastic/go-windows v1.0.0 // indirect
	github.com/joeshaw/multierror v0.0.0-20140124173710-69b34d4ec901 // indirect
	github.com/pkg/errors v0.8.1 // indirect
	github.com/prometheus/procfs v0.0.0-20190425082905-87a4384529e0 // indirect
	golang.org/x/sys v0.0.0-20191025021431-6c3a3bfe00ae // indirect
	howett.net/plist v0.0.0-20181124034731-591f970eefbb // indirect
)
