{
	"pages": [
		{
			"path": "pages/login/login",
			"style": {
				"navigationBarTitleText": "登录"
			}
		},
		{
			"path": "pages/main/index",
			"style": {
				"navigationBarTitleText": "首页"
			}
		}, 
		{
			"path": "pages/user/user",
			"style": {
				"navigationBarTitleText": "我的"
			}
		}, 
		{
			"path": "pages/telbook/index",
			"style": {
				"navigationBarTitleText": "通讯录"
			}
		},
		{
			"path":"pages/moments/index",
			"style":{
				"navigationBarTitleText": "同事圈"
			}
		}
	],
	"tabBar": {
		"color": "#7a7e83",
		"selectedColor": "#0faeff",
		"backgroundColor": "#ffffff",
		"list": [
			{
				"pagePath": "pages/telbook/index",
				"text": "通讯录"
			}, 
			{
				"pagePath": "pages/main/index",
				"text": "首页"
			}, 
			{
				"pagePath": "pages/moments/index",
				"text": "同事圈"
			}, 
			{
				"pagePath": "pages/user/user",
				"text": "我的"
			}
		]
	},
	"globalStyle": {
		"navigationBarTextStyle": "white",
		"navigationBarBackgroundColor": "#0faeff",
		"backgroundColor": "#fbf9fe"
	},
	"condition" : { //模式配置，仅开发期间生效
		"current": 0, //当前激活的模式(list 的索引项)
		"list": [
			{
				"name": "", //模式名称
				"path": "", //启动页面，必选
				"query": "" //启动参数，在页面的onLoad函数里面得到
			}
		]
	}
}
