<?xml version="1.0" encoding="UTF-8"?>
<svg width="477px" height="136px" viewBox="0 0 477 136" version="1.1" xmlns="http://www.w3.org/2000/svg" xmlns:xlink="http://www.w3.org/1999/xlink">
    <!-- Generator: Sketch 51.3 (57544) - http://www.bohemiancoding.com/sketch -->
    <title>Shape</title>
    <desc>Created with Sketch.</desc>
    <defs>
        <path d="M103.647667,36 L91.3300573,48.1763397 L91.3300573,66.5675014 L78.0420111,66.5675014 L78.0420111,58.3655748 L65.7250144,46.1892351 L47.4292147,46.1892351 L35.1111959,58.3655748 L35.1111959,97.1354104 L30,97.1354104 L30.0181944,171.976157 L37.1735006,172 L37.1571461,104.267875 L57.6505842,104.267875 L70.8869093,117.360634 L70.8869093,132.950572 L91.3300573,148.234424 L91.3300573,161.734957 L98.4851591,161.734957 L98.4851591,144.668192 L78.0420111,129.384136 L78.0420111,115.883399 L78.0420111,114.406368 L78.0420111,73.699966 L93.4262977,73.699966 L101.551631,81.6983117 L101.551631,117.307854 L108.706529,110.175593 L108.706529,78.7440449 L98.4851591,68.5548098 L98.4851591,51.1306065 L106.611515,43.1322608 L124.090815,43.1322608 L132.216353,51.1306065 L132.216353,129.233335 L139.371455,122.101074 L139.371455,73.699966 L154.742045,73.699966 L162.881075,81.8156917 L162.881075,171.924396 L170.036177,171.924396 L170.036177,78.8879169 L157.732673,66.5675014 L139.371455,66.5675014 L139.371455,48.1763397 L127.054663,36 L103.647667,36 Z M42.2665021,61.3200454 L50.3928578,53.3216996 L62.7613712,53.3216996 L70.8869093,61.3200454 L70.8869093,107.273903 L60.6142274,97.1354104 L42.2665021,97.1354104 L42.2665021,61.3200454 Z M53.5062726,117 C57.0968002,117 60.0077522,119.9102 60.0077522,123.5002 C60.0077522,127.09 57.0970003,130 53.5062726,130 C49.9153449,130 47.0043929,127.0898 47.0043929,123.5 C47.0043929,119.91 49.9151449,117 53.5062726,117 Z M206.344114,100.58298 L201.753134,96.0033629 L201.753134,36.1283449 L208.04453,36.1283449 L208.04453,94.8160096 L211.700291,94.8160096 L211.700291,36.1283449 L217.99189,36.1283449 L217.99189,96.0033629 L213.400706,100.58298 L206.344114,100.58298 Z M232.190065,100.582898 L232.190065,71.2390659 L228.534508,71.2390659 L228.534508,100.582898 L222.242909,100.582898 L222.242909,36.1282635 L233.890685,36.1282635 L238.481664,40.7078802 L238.481664,65.3871976 L235.505988,68.2706826 L238.481664,71.2390659 L238.481664,100.582898 L232.190065,100.582898 Z M228.534304,65.4720958 L232.190065,65.4720958 L232.190065,41.8952335 L228.534304,41.8952335 L228.534304,65.4720958 Z M242.732806,100.582898 L242.732806,36.1282635 L254.380378,36.1282635 L258.971561,40.7078802 L258.971561,65.3871976 L255.995885,68.2706826 L258.971561,71.2390659 L258.971561,96.0032814 L254.380378,100.582898 L242.732806,100.582898 Z M249.024201,94.8159281 L252.679962,94.8159281 L252.679962,71.2390659 L249.024201,71.2390659 L249.024201,94.8159281 Z M249.024201,65.4720958 L252.679962,65.4720958 L252.679962,41.8952335 L249.024201,41.8952335 L249.024201,65.4720958 Z M274.785427,100.583061 L273.850209,88.3705461 L269.344138,88.3705461 L268.408919,100.583061 L262.11732,100.583061 L267.983765,36.1282228 L275.210378,36.1282228 L281.076823,100.583061 L274.785427,100.583061 Z M271.639526,59.1114084 L271.554617,59.1114084 L269.769089,82.603576 L273.425054,82.603576 L271.639526,59.1114084 Z M296.465268,100.58298 L290.683732,66.7442251 L290.513915,66.7442251 L290.513915,100.58298 L284.222316,100.58298 L284.222316,36.1283449 L290.513915,36.1283449 L296.295247,70.051794 L296.465268,70.051794 L296.465268,36.1283449 L302.756868,36.1283449 L302.756868,100.58298 L296.465268,100.58298 Z M206.34342,172 L201.75244,167.420383 L201.75244,155.292766 L208.043836,155.292766 L208.043836,166.23303 L211.699597,166.23303 L211.699597,142.656168 L206.34342,142.656168 L201.75244,138.161246 L201.75244,112.124982 L206.34342,107.545162 L213.400012,107.545162 L217.991196,112.124982 L217.991196,124.252599 L211.699597,124.252599 L211.699597,113.312335 L208.043836,113.312335 L208.043836,136.889198 L213.400012,136.889198 L217.991196,141.299222 L217.991196,167.420383 L213.400012,172 L206.34342,172 Z M222.242296,172 L222.242296,107.545162 L233.889868,107.545162 L238.481052,112.124982 L238.481052,137.991653 L233.889868,142.656168 L228.533692,142.656168 L228.533692,172 L222.242296,172 Z M228.533692,136.889198 L232.189453,136.889198 L232.189453,113.312335 L228.533692,113.312335 L228.533692,136.889198 Z M242.476508,172 L242.476508,107.545162 L256.419876,107.545162 L256.419876,113.312335 L248.768108,113.312335 L248.768108,136.889198 L253.359087,136.889198 L253.359087,142.656168 L248.768108,142.656168 L248.768108,166.23303 L256.419876,166.23303 L256.419876,172 L242.476508,172 Z M264.66576,172 L260.07478,167.420383 L260.07478,112.124982 L264.66576,107.545162 L271.807465,107.545162 L276.313536,112.124982 L276.313536,126.033629 L270.021937,126.033629 L270.021937,113.312335 L266.366175,113.312335 L266.366175,166.23303 L270.021937,166.23303 L270.021937,153.511533 L276.313536,153.511533 L276.313536,167.420383 L271.722352,172 L264.66576,172 Z M280.564453,172 L280.564453,107.545162 L286.856052,107.545162 L286.856052,172 L280.564453,172 Z M291.106642,172 L291.106642,107.545162 L305.05001,107.545162 L305.05001,113.312335 L297.398241,113.312335 L297.398241,136.889198 L301.989221,136.889198 L301.989221,142.656168 L297.398241,142.656168 L297.398241,166.23303 L305.05001,166.23303 L305.05001,172 L291.106642,172 Z M313.295893,172 L308.70471,167.420383 L308.70471,155.292766 L314.996309,155.292766 L314.996309,166.23303 L318.65207,166.23303 L318.65207,142.656168 L313.295893,142.656168 L308.70471,138.161246 L308.70471,112.124982 L313.295893,107.545162 L320.352486,107.545162 L324.94367,112.124982 L324.94367,124.252599 L318.65207,124.252599 L318.65207,113.312335 L314.996309,113.312335 L314.996309,136.889198 L320.352486,136.889198 L324.94367,141.299222 L324.94367,167.420383 L320.352486,172 L313.295893,172 Z M357.365847,100.582796 L357.365847,36.1281617 L371.309623,36.1281617 L371.309623,41.8951317 L363.657447,41.8951317 L363.657447,65.471994 L368.248834,65.471994 L368.248834,71.2389641 L363.657447,71.2389641 L363.657447,94.8158263 L371.309623,94.8158263 L371.309623,100.582796 L357.365847,100.582796 Z M379.555446,100.582796 L374.964262,96.0031796 L374.964262,83.8755629 L381.255861,83.8755629 L381.255861,94.8158263 L384.912031,94.8158263 L384.912031,71.2389641 L379.555446,71.2389641 L374.964262,66.7440419 L374.964262,40.7077784 L379.555446,36.1281617 L386.612446,36.1281617 L391.20363,40.7077784 L391.20363,52.8353952 L384.912031,52.8353952 L384.912031,41.8951317 L381.255861,41.8951317 L381.255861,65.471994 L386.612446,65.471994 L391.20363,69.882018 L391.20363,96.0031796 L386.612446,100.582796 L379.555446,100.582796 Z M395.454261,100.582898 L395.454261,36.1280599 L407.102445,36.1280599 L411.693629,40.7076766 L411.693629,66.5743473 L407.102445,71.2388623 L401.74586,71.2388623 L401.74586,100.582898 L395.454261,100.582898 Z M401.74586,65.4718922 L405.40203,65.4718922 L405.40203,41.8950299 L401.74586,41.8950299 L401.74586,65.4718922 Z M415.688718,100.582796 L415.688718,36.1281617 L429.632494,36.1281617 L429.632494,41.8951317 L421.980317,41.8951317 L421.980317,65.471994 L426.571705,65.471994 L426.571705,71.2389641 L421.980317,71.2389641 L421.980317,94.8158263 L429.632494,94.8158263 L429.632494,100.582796 L415.688718,100.582796 Z M437.878337,100.582796 L433.287153,96.0031796 L433.287153,40.7077784 L437.878337,36.1281617 L445.020246,36.1281617 L449.526521,40.7077784 L449.526521,54.6164251 L443.234922,54.6164251 L443.234922,41.8951317 L439.578752,41.8951317 L439.578752,94.8158263 L443.234922,94.8158263 L443.234922,82.0943293 L449.526521,82.0943293 L449.526521,96.0031796 L444.935337,100.582796 L437.878337,100.582796 Z M453.777131,100.582796 L453.777131,36.1281617 L467.720908,36.1281617 L467.720908,41.8951317 L460.068731,41.8951317 L460.068731,65.471994 L464.660119,65.471994 L464.660119,71.2389641 L460.068731,71.2389641 L460.068731,94.8158263 L467.720908,94.8158263 L467.720908,100.582796 L453.777131,100.582796 Z M475.966689,100.582796 L471.375505,96.0031796 L471.375505,83.8755629 L477.667105,83.8755629 L477.667105,94.8158263 L481.323274,94.8158263 L481.323274,71.2389641 L475.966689,71.2389641 L471.375505,66.7440419 L471.375505,40.7077784 L475.966689,36.1281617 L483.02369,36.1281617 L487.614873,40.7077784 L487.614873,52.8353952 L481.323274,52.8353952 L481.323274,41.8951317 L477.667105,41.8951317 L477.667105,65.471994 L483.02369,65.471994 L487.614873,69.882018 L487.614873,96.0031796 L483.02369,100.582796 L475.966689,100.582796 Z M361.956398,171.999817 L357.365215,167.4202 L357.365215,107.544978 L363.656814,107.544978 L363.656814,166.232847 L367.312983,166.232847 L367.312983,107.544978 L373.604583,107.544978 L373.604583,167.4202 L369.013399,171.999817 L361.956398,171.999817 Z M387.802901,171.999796 L387.802901,142.655964 L384.146935,142.655964 L384.146935,171.999796 L377.855132,171.999796 L377.855132,107.545162 L389.503316,107.545162 L394.094704,112.124778 L394.094704,136.804096 L391.118823,139.687581 L394.094704,142.655964 L394.094704,171.999796 L387.802901,171.999796 Z M384.146731,136.888994 L387.802901,136.888994 L387.802901,113.312132 L384.146731,113.312132 L384.146731,136.888994 Z M398.345233,171.999796 L398.345233,107.545162 L409.993417,107.545162 L414.584601,112.124778 L414.584601,136.804096 L411.608924,139.687581 L414.584601,142.655964 L414.584601,167.42018 L409.993417,171.999796 L398.345233,171.999796 Z M404.636832,166.232826 L408.293002,166.232826 L408.293002,142.655964 L404.636832,142.655964 L404.636832,166.232826 Z M404.636832,136.888994 L408.293002,136.888994 L408.293002,113.312132 L404.636832,113.312132 L404.636832,136.888994 Z M430.398406,171.999919 L429.463187,159.7872 L424.956912,159.7872 L424.021694,171.999919 L417.730094,171.999919 L423.596539,107.54508 L430.823357,107.54508 L436.690005,171.999919 L430.398406,171.999919 Z M427.252504,130.528266 L427.167595,130.528266 L425.382067,154.020434 L429.038032,154.020434 L427.252504,130.528266 Z M439.83509,172 L439.83509,107.545162 L446.12669,107.545162 L446.12669,172 L439.83509,172 Z M462.620701,171.999817 L456.838962,138.161062 L456.66894,138.161062 L456.66894,171.999817 L450.377341,171.999817 L450.377341,107.544978 L456.66894,107.544978 L462.45068,141.468631 L462.620701,141.468631 L462.620701,107.544978 L468.912301,107.544978 L468.912301,171.999817 L462.620701,171.999817 Z M473.162258,171.999817 L473.162258,107.544978 L487.106034,107.544978 L487.106034,113.312152 L479.453858,113.312152 L479.453858,136.889014 L484.045245,136.889014 L484.045245,142.655984 L479.453858,142.655984 L479.453858,166.232847 L487.106034,166.232847 L487.106034,171.999817 L473.162258,171.999817 Z M495.351816,171.999817 L490.760632,167.4202 L490.760632,155.292583 L497.052231,155.292583 L497.052231,166.232847 L500.708401,166.232847 L500.708401,142.655984 L495.351816,142.655984 L490.760632,138.161062 L490.760632,112.124799 L495.351816,107.544978 L502.408816,107.544978 L507,112.124799 L507,124.252416 L500.708401,124.252416 L500.708401,113.312152 L497.052231,113.312152 L497.052231,136.889014 L502.408816,136.889014 L507,141.299038 L507,167.4202 L502.408816,171.999817 L495.351816,171.999817 Z" id="path-1"></path>
    </defs>
    <g id="Components" stroke="none" stroke-width="1" fill="none" fill-rule="evenodd">
        <g id="Icons/Log-typo" transform="translate(-30.000000, -36.000000)">
            <mask id="mask-2" fill="white">
                <use xlink:href="#path-1"></use>
            </mask>
            <use id="Shape" fill="#000000" xlink:href="#path-1"></use>
        </g>
    </g>
</svg>