<svg width="109" height="81" viewBox="0 0 109 81" fill="none" xmlns="http://www.w3.org/2000/svg">
<path d="M21.24 64.48C20.6 64.48 20.0667 64.2933 19.64 63.92C18.7867 63.2267 18.5467 62.3467 18.92 61.28C18.92 61.2267 19.1067 60.5867 19.48 59.36C19.9067 58.1333 20.3867 56.7467 20.92 55.2C21.1867 54.2933 21.4267 53.52 21.64 52.88C21.8533 52.1867 22.04 51.5733 22.2 51.04C20.76 51.5733 19 52.24 16.92 53.04C14.84 53.7867 12.6533 54.5867 10.36 55.44C8.12 56.2933 5.93333 57.12 3.8 57.92C3.21333 58.1333 2.62667 58.1067 2.04 57.84C1.4 57.52 0.946669 57.04 0.680002 56.4C0.466669 55.8133 0.520002 55.2267 0.840002 54.64C1.10667 54 1.56 53.5467 2.2 53.28C4.6 52.4267 7.08 51.5467 9.64 50.64C12.2 49.68 14.5733 48.8 16.76 48C18.9467 47.1467 20.7333 46.4533 22.12 45.92C23.5067 45.3867 24.2 45.12 24.2 45.12C24.4667 45.0667 24.7333 45.04 25 45.04C25.2667 44.9867 25.5067 45.0133 25.72 45.12C26.4667 45.2267 27 45.6533 27.32 46.4C27.5867 46.8267 27.6933 47.3867 27.64 48.08C27.64 48.72 27.5067 49.6533 27.24 50.88C27.08 51.5733 26.8667 52.3467 26.6 53.2C26.3867 54 26.0933 54.9333 25.72 56C25.6667 56.2133 25.6133 56.4 25.56 56.56C25.5067 56.72 25.4533 56.9067 25.4 57.12C27.5333 55.9467 30.1467 54.72 33.24 53.44C33.8267 53.1733 34.4133 53.1733 35 53.44C35.64 53.6533 36.0667 54.0533 36.28 54.64C36.6 55.2267 36.6267 55.84 36.36 56.48C36.0933 57.12 35.6667 57.5733 35.08 57.84C32.68 58.9067 30.52 59.92 28.6 60.88C26.7333 61.84 25.24 62.6133 24.12 63.2C23 63.7867 22.44 64.08 22.44 64.08C22.12 64.3467 21.72 64.48 21.24 64.48ZM52.3338 64.48C51.6938 64.48 51.1604 64.2933 50.7338 63.92C49.8804 63.2267 49.6404 62.3467 50.0138 61.28C50.0138 61.2267 50.2004 60.5867 50.5738 59.36C51.0004 58.1333 51.4804 56.7467 52.0138 55.2C52.2804 54.2933 52.5204 53.52 52.7338 52.88C52.9471 52.1867 53.1338 51.5733 53.2938 51.04C51.8538 51.5733 50.0938 52.24 48.0138 53.04C45.9338 53.7867 43.7471 54.5867 41.4538 55.44C39.2138 56.2933 37.0271 57.12 34.8938 57.92C34.3071 58.1333 33.7204 58.1067 33.1337 57.84C32.4937 57.52 32.0404 57.04 31.7737 56.4C31.5604 55.8133 31.6137 55.2267 31.9337 54.64C32.2004 54 32.6537 53.5467 33.2937 53.28C35.6937 52.4267 38.1738 51.5467 40.7338 50.64C43.2938 49.68 45.6671 48.8 47.8538 48C50.0404 47.1467 51.8271 46.4533 53.2138 45.92C54.6004 45.3867 55.2938 45.12 55.2938 45.12C55.5604 45.0667 55.8271 45.04 56.0938 45.04C56.3604 44.9867 56.6004 45.0133 56.8138 45.12C57.5604 45.2267 58.0938 45.6533 58.4138 46.4C58.6804 46.8267 58.7871 47.3867 58.7338 48.08C58.7338 48.72 58.6004 49.6533 58.3338 50.88C58.1738 51.5733 57.9604 52.3467 57.6938 53.2C57.4804 54 57.1871 54.9333 56.8138 56C56.7604 56.2133 56.7071 56.4 56.6538 56.56C56.6004 56.72 56.5471 56.9067 56.4938 57.12C58.6271 55.9467 61.2404 54.72 64.3338 53.44C64.9204 53.1733 65.5071 53.1733 66.0938 53.44C66.7338 53.6533 67.1604 54.0533 67.3738 54.64C67.6938 55.2267 67.7204 55.84 67.4538 56.48C67.1871 57.12 66.7604 57.5733 66.1738 57.84C63.7738 58.9067 61.6138 59.92 59.6938 60.88C57.8271 61.84 56.3338 62.6133 55.2137 63.2C54.0938 63.7867 53.5338 64.08 53.5338 64.08C53.2138 64.3467 52.8138 64.48 52.3338 64.48ZM75.2675 69.2C75.0008 69.2 74.7342 69.1733 74.4675 69.12C74.2008 69.12 73.9075 69.0933 73.5875 69.04C72.9475 68.8267 72.4142 68.3733 71.9875 67.68C71.7742 67.2533 71.6675 66.6667 71.6675 65.92C71.6675 65.1733 71.9075 63.9467 72.3875 62.24C72.8675 60.5333 73.6408 58 74.7075 54.64C73.5342 55.0667 72.1742 55.5733 70.6275 56.16C69.1342 56.7467 67.5875 57.3333 65.9875 57.92C65.4008 58.1333 64.8142 58.1067 64.2275 57.84C63.5875 57.52 63.1342 57.04 62.8675 56.4C62.6542 55.8133 62.7075 55.2267 63.0275 54.64C63.2942 54 63.7475 53.5467 64.3875 53.28C66.6808 52.4267 68.8142 51.6267 70.7875 50.88C72.8142 50.1333 74.4675 49.52 75.7475 49.04C77.0275 48.56 77.6675 48.32 77.6675 48.32C78.2008 48.1067 78.7075 48.08 79.1875 48.24C79.8808 48.4 80.3875 48.8 80.7075 49.44C80.9742 49.92 81.0542 50.3467 80.9475 50.72C80.8942 51.0933 80.8142 51.4933 80.7075 51.92C80.6008 52.1333 80.5208 52.3733 80.4675 52.64C80.4142 52.8533 80.3342 53.12 80.2275 53.44C79.8542 54.3467 79.4542 55.4667 79.0275 56.8C78.6542 58.08 78.2542 59.3867 77.8275 60.72C77.5608 61.4667 77.3475 62.1067 77.1875 62.64C77.0275 63.1733 76.8942 63.6533 76.7875 64.08C77.8008 63.8667 79.2675 63.2533 81.1875 62.24C82.8408 61.3333 84.6008 60.2933 86.4675 59.12C88.3875 57.8933 90.3342 56.6133 92.3075 55.28C92.7342 55.0133 93.1608 54.7467 93.5875 54.48C94.0675 54.2133 94.4942 53.92 94.8675 53.6C95.4542 53.2267 96.0675 53.12 96.7075 53.28C97.4008 53.3867 97.9342 53.7333 98.3075 54.32C98.6808 54.8533 98.7875 55.44 98.6275 56.08C98.5208 56.72 98.1742 57.2267 97.5875 57.6C97.1608 57.92 96.7075 58.24 96.2275 58.56C95.8008 58.8267 95.3475 59.12 94.8675 59.44C92.8408 60.7733 90.8675 62.0533 88.9475 63.28C87.0275 64.5067 85.2142 65.5733 83.5075 66.48C80.0408 68.2933 77.2942 69.2 75.2675 69.2Z" fill="#343B43"/>
<path d="M76 16C76 23.4558 69.9558 29.5 62.5 29.5C55.0442 29.5 49 23.4558 49 16C49 8.54416 55.0442 2.5 62.5 2.5C69.9558 2.5 76 8.54416 76 16Z" stroke="#343B43" stroke-width="5"/>
</svg>
