<?xml version="1.0" encoding="UTF-8" standalone="no"?>
<svg
   xmlns:dc="http://purl.org/dc/elements/1.1/"
   xmlns:cc="http://creativecommons.org/ns#"
   xmlns:rdf="http://www.w3.org/1999/02/22-rdf-syntax-ns#"
   xmlns:svg="http://www.w3.org/2000/svg"
   xmlns="http://www.w3.org/2000/svg"
   xmlns:sodipodi="http://sodipodi.sourceforge.net/DTD/sodipodi-0.dtd"
   xmlns:inkscape="http://www.inkscape.org/namespaces/inkscape"
   id="svg8"
   version="1.1"
   viewBox="0 0 113.45436 112.78635"
   height="112.78635mm"
   width="113.45436mm"
   sodipodi:docname="Zahnrad.svg"
   inkscape:version="0.92.5 (2060ec1f9f, 2020-04-08)">
  <sodipodi:namedview
     pagecolor="#ffffff"
     bordercolor="#666666"
     borderopacity="1"
     objecttolerance="10"
     gridtolerance="10"
     guidetolerance="10"
     inkscape:pageopacity="0"
     inkscape:pageshadow="2"
     inkscape:window-width="1920"
     inkscape:window-height="1010"
     id="namedview8"
     showgrid="false"
     inkscape:zoom="0.78294807"
     inkscape:cx="245.24576"
     inkscape:cy="196.7392"
     inkscape:window-x="1920"
     inkscape:window-y="0"
     inkscape:window-maximized="1"
     inkscape:current-layer="svg8" />
  <defs
     id="defs2" />
  <metadata
     id="metadata5">
    <rdf:RDF>
      <cc:Work
         rdf:about="">
        <dc:format>image/svg+xml</dc:format>
        <dc:type
           rdf:resource="http://purl.org/dc/dcmitype/StillImage" />
        <dc:title />
      </cc:Work>
    </rdf:RDF>
  </metadata>
  <path
     inkscape:connector-curvature="0"
     style="fill:none;stroke:#000000;stroke-width:1.56656516;stroke-linecap:butt;stroke-linejoin:miter;stroke-miterlimit:4;stroke-dasharray:none;stroke-opacity:1"
     d="m 33.623677,-27.0341 h 7.890135 l 4.35355,-11.56628 12.95798,-0.0168 4.08811,11.58447 8.31943,-10e-4"
     id="path815" />
  <path
     inkscape:connector-curvature="0"
     style="opacity:1;fill:none;fill-opacity:0.59183673;stroke:#ffffff;stroke-width:4.38968039;stroke-miterlimit:4;stroke-dasharray:none;stroke-opacity:1"
     d="m 85.958964,56.332632 c 0.02668,1.571749 -0.110478,3.136825 -0.394691,4.679089 2.370568,1.328081 4.641525,2.899276 6.794609,4.689043 -0.926371,3.185456 -2.287023,6.221886 -4.008102,9.037515 -2.745764,-0.470837 -5.423267,-1.144477 -8.011565,-2.003896 -1.010869,1.37056 -2.134809,2.667109 -3.35221,3.870712 -1.15456,1.141534 -2.393348,2.199264 -3.699447,3.157228 0.809012,2.62278 1.421379,5.339499 1.818841,8.125616 -2.822767,1.714292 -5.865215,3.071473 -9.05348,3.999748 -1.725523,-2.185628 -3.247276,-4.476468 -4.544319,-6.855472 -1.632252,0.31445 -3.28892,0.469311 -4.950394,0.445654 -7e-6,0 -1.5e-5,-7e-6 -2.2e-5,-1.3e-5 -1.575773,0.02289 -3.147255,-0.11501 -4.697721,-0.397375 -1.325426,2.378775 -2.891018,4.662233 -4.672899,6.831269 -3.192982,-0.909941 -6.243177,-2.250171 -9.076193,-3.949457 0.448271,-2.755963 1.097617,-5.444906 1.931761,-8.045285 -1.384921,-0.998382 -2.69605,-2.108674 -3.913767,-3.31196 -1.154924,-1.141168 -2.225619,-2.366146 -3.195536,-3.658603 -2.611089,0.834816 -5.316746,1.472009 -8.093092,1.892452 -1.736064,-2.805228 -3.113687,-5.833743 -4.05848,-9.014303 2.169862,-1.733647 4.448112,-3.261351 6.818474,-4.561581 -0.316699,-1.623385 -0.470914,-3.273155 -0.443024,-4.930381 -10e-7,-2e-5 -10e-7,-4e-5 -2e-6,-6.1e-5 -0.02692,-1.571748 0.110226,-3.136825 0.394445,-4.679089 -2.370563,-1.328081 -4.641515,-2.899289 -6.7946,-4.689056 0.926383,-3.18545 2.287043,-6.221886 4.008128,-9.037509 2.745763,0.470844 5.423261,1.144492 8.011562,2.003917 1.010871,-1.37056 2.134813,-2.667103 3.352218,-3.870706 1.15456,-1.141533 2.393349,-2.199264 3.699448,-3.15722 -0.809002,-2.62278 -1.421361,-5.3395 -1.818821,-8.125624 2.822774,-1.714285 5.86522,-3.071459 9.053488,-3.999721 1.725522,2.185629 3.247267,4.476474 4.544304,6.855479 1.632232,-0.314436 3.288877,-0.469298 4.950329,-0.445641 3.2e-5,-6e-6 6.5e-5,-6e-6 9.7e-5,-6e-6 1.575766,-0.02289 3.147246,0.115036 4.697715,0.397408 1.325427,-2.378768 2.89103,-4.662233 4.672909,-6.831255 3.192986,0.909947 6.243173,2.250184 9.076185,3.94947 -0.448274,2.75597 -1.09763,5.444906 -1.931777,8.045285 1.384917,0.998382 2.696047,2.108681 3.913758,3.311967 1.154925,1.141175 2.225616,2.366153 3.195532,3.65861 2.61109,-0.83481 5.316748,-1.471995 8.093091,-1.892439 1.736058,2.805236 3.113675,5.833751 4.058462,9.014317 -2.169866,1.733647 -4.448117,3.261344 -6.818482,4.561567 0.316697,1.623405 0.470903,3.273196 0.443005,4.930442"
     id="path817" />
</svg>
