{
  "logging": true,
  "fileBasePath": "/home/janik/Music",
  "comparerBaseType": "file",
  "comparerCompareType": "spotify",
  "spotifyClientId": "192ff73c6bd242fbab366eba93a6095b",
  "spotifyClientSecret": "6d1573dae0c9433587b558110ac407f5"
}