<?xml version="1.0" encoding="UTF-8"?>
<svg xmlns="http://www.w3.org/2000/svg" xmlns:xlink="http://www.w3.org/1999/xlink" width="384px" height="384px" viewBox="0 0 384 384" version="1.1">
<g id="surface1">
<rect x="0" y="0" width="384" height="384" style="fill:rgb(88.235294%,92.156863%,94.117647%);fill-opacity:1;stroke:none;"/>
<path style=" stroke:none;fill-rule:nonzero;fill:rgb(20%,33.72549%,39.607843%);fill-opacity:1;" d="M 119.121094 275.160156 C 119.121094 273.730469 118.949219 272.449219 118.628906 271.300781 L 86.339844 271.300781 C 86.191406 272.050781 86.078125 272.789062 86.03125 273.539062 C 85.980469 274.289062 85.949219 274.949219 85.949219 275.519531 C 85.949219 276.089844 85.980469 276.738281 86.03125 277.460938 C 86.078125 278.179688 86.191406 278.921875 86.339844 279.671875 L 93.261719 279.671875 C 93.769531 279.671875 94.460938 279.660156 95.339844 279.640625 C 96.21875 279.621094 96.898438 279.609375 97.378906 279.609375 L 97.441406 279.609375 C 97.441406 280.53125 97.429688 281.351562 97.410156 282.058594 C 97.390625 282.769531 97.378906 283.578125 97.378906 284.480469 L 97.378906 316.308594 C 98.238281 316.460938 99.121094 316.558594 100.03125 316.609375 C 100.941406 316.648438 101.738281 316.671875 102.421875 316.671875 C 103.101562 316.671875 103.921875 316.648438 104.828125 316.609375 C 105.730469 316.570312 106.609375 316.46875 107.46875 316.308594 L 107.46875 284.480469 C 107.46875 283.578125 107.460938 282.769531 107.441406 282.058594 C 107.421875 281.351562 107.410156 280.53125 107.410156 279.609375 L 107.480469 279.609375 C 107.960938 279.609375 108.648438 279.609375 109.539062 279.640625 C 110.429688 279.660156 111.121094 279.671875 111.601562 279.671875 L 113.839844 279.671875 C 115.660156 279.671875 117 279.328125 117.859375 278.648438 C 118.71875 277.96875 119.148438 276.808594 119.148438 275.160156 Z M 119.121094 275.160156 "/>
<path style=" stroke:none;fill-rule:nonzero;fill:rgb(20%,33.72549%,39.607843%);fill-opacity:1;" d="M 138.878906 284.679688 C 136.640625 283.230469 133.859375 282.511719 130.539062 282.511719 C 127.21875 282.511719 124.511719 283.230469 122.269531 284.671875 C 120.03125 286.109375 118.339844 288.128906 117.199219 290.730469 C 116.058594 293.328125 115.488281 296.390625 115.488281 299.910156 C 115.488281 303.429688 116.058594 306.421875 117.191406 309.019531 C 118.320312 311.621094 120.011719 313.648438 122.25 315.101562 C 124.488281 316.550781 127.261719 317.269531 130.550781 317.269531 C 133.839844 317.269531 136.609375 316.550781 138.851562 315.109375 C 141.089844 313.671875 142.78125 311.648438 143.921875 309.050781 C 145.058594 306.449219 145.628906 303.398438 145.628906 299.910156 C 145.628906 296.421875 145.058594 293.371094 143.929688 290.769531 C 142.800781 288.171875 141.109375 286.140625 138.871094 284.691406 Z M 135.191406 304.941406 C 134.949219 306.449219 134.480469 307.660156 133.769531 308.558594 C 133.070312 309.460938 132 309.910156 130.570312 309.910156 C 129.140625 309.910156 128.070312 309.460938 127.359375 308.558594 C 126.648438 307.660156 126.171875 306.449219 125.929688 304.941406 C 125.691406 303.429688 125.570312 301.738281 125.570312 299.898438 C 125.570312 298.058594 125.691406 296.371094 125.929688 294.839844 C 126.171875 293.308594 126.648438 292.101562 127.359375 291.199219 C 128.070312 290.300781 129.140625 289.851562 130.570312 289.851562 C 132 289.851562 133.058594 290.300781 133.769531 291.199219 C 134.46875 292.101562 134.941406 293.308594 135.191406 294.839844 C 135.429688 296.371094 135.550781 298.050781 135.550781 299.898438 C 135.550781 301.75 135.429688 303.429688 135.191406 304.941406 Z M 135.191406 304.941406 "/>
<path style=" stroke:none;fill-rule:nonzero;fill:rgb(20%,33.72549%,39.607843%);fill-opacity:1;" d="M 175.738281 284.679688 C 173.988281 283.230469 171.789062 282.511719 169.128906 282.511719 C 167 282.511719 165.039062 283.03125 163.261719 284.058594 C 162.179688 284.691406 161.25 285.46875 160.398438 286.308594 C 160.199219 285.929688 159.980469 285.570312 159.71875 285.238281 C 158.539062 283.769531 156.949219 283.03125 154.929688 283.03125 L 152.289062 283.03125 L 151.828125 283.488281 L 151.828125 330.078125 L 152.289062 330.539062 L 156.109375 330.539062 C 158.070312 330.539062 159.449219 330.101562 160.261719 329.210938 C 161.070312 328.320312 161.480469 326.78125 161.480469 324.578125 L 161.480469 315.390625 C 161.570312 315.441406 161.648438 315.488281 161.738281 315.539062 C 163.5 316.46875 165.511719 316.941406 167.769531 316.941406 C 170.03125 316.941406 172.328125 316.28125 174.328125 314.949219 C 176.328125 313.621094 177.929688 311.660156 179.121094 309.070312 C 180.320312 306.480469 180.921875 303.289062 180.921875 299.511719 C 180.921875 296.171875 180.488281 293.230469 179.640625 290.679688 C 178.78125 288.128906 177.480469 286.128906 175.738281 284.679688 Z M 170.339844 304.878906 C 170 306.390625 169.480469 307.558594 168.769531 308.371094 C 168.070312 309.179688 167.179688 309.589844 166.101562 309.589844 C 164.960938 309.589844 163.710938 309.199219 162.359375 308.441406 C 162.058594 308.269531 161.78125 308.070312 161.488281 307.890625 L 161.488281 293.25 C 162.308594 292.21875 163.160156 291.46875 164.039062 291.070312 C 165.019531 290.628906 165.878906 290.410156 166.628906 290.410156 C 167.441406 290.410156 168.160156 290.71875 168.789062 291.351562 C 169.421875 291.980469 169.921875 292.949219 170.289062 294.269531 C 170.660156 295.589844 170.851562 297.308594 170.851562 299.441406 C 170.851562 301.570312 170.679688 303.359375 170.339844 304.878906 Z M 170.339844 304.878906 "/>
<path style=" stroke:none;fill-rule:nonzero;fill:rgb(20%,33.72549%,39.607843%);fill-opacity:1;" d="M 204.71875 283 C 202.789062 283 201.191406 283.441406 199.929688 284.320312 C 198.671875 285.199219 197.671875 286.371094 196.929688 287.828125 C 196.738281 288.210938 196.589844 288.640625 196.421875 289.039062 C 196.019531 288.050781 195.539062 287.121094 194.949219 286.328125 C 193.46875 284.351562 191.261719 283.21875 188.339844 282.941406 C 187.71875 283.421875 187.109375 284.171875 186.488281 285.179688 C 185.871094 286.191406 185.46875 287.128906 185.269531 288.011719 C 185.820312 288.429688 186.371094 289.191406 186.929688 290.300781 C 187.488281 291.410156 187.769531 292.929688 187.769531 294.859375 L 187.769531 316.308594 C 189.261719 316.550781 190.898438 316.671875 192.679688 316.671875 C 194.460938 316.671875 196.140625 316.550781 197.589844 316.308594 L 197.589844 295.640625 C 197.949219 295.070312 198.320312 294.539062 198.730469 294.101562 C 199.308594 293.460938 199.96875 292.96875 200.710938 292.621094 C 201.449219 292.269531 202.28125 292.089844 203.199219 292.089844 C 203.769531 292.148438 204.328125 292.230469 204.859375 292.300781 C 205.398438 292.378906 205.941406 292.519531 206.488281 292.710938 C 207.320312 291.351562 207.941406 289.769531 208.328125 287.980469 C 208.730469 286.191406 208.921875 284.710938 208.921875 283.550781 C 208.28125 283.371094 207.660156 283.230469 207.039062 283.140625 C 206.421875 283.050781 205.640625 282.988281 204.699219 282.988281 Z M 204.71875 283 "/>
<path style=" stroke:none;fill-rule:nonzero;fill:rgb(20%,33.72549%,39.607843%);fill-opacity:1;" d="M 238.660156 309.941406 C 238.371094 309.199219 238.230469 308.328125 238.230469 307.320312 L 238.230469 293.910156 C 238.230469 291.160156 237.671875 288.96875 236.550781 287.339844 C 235.429688 285.699219 233.980469 284.519531 232.21875 283.800781 C 230.449219 283.078125 228.589844 282.710938 226.640625 282.710938 C 225.210938 282.710938 223.621094 282.828125 221.859375 283.070312 C 220.101562 283.308594 218.339844 283.648438 216.570312 284.089844 C 214.800781 284.53125 213.191406 285.050781 211.738281 285.640625 C 211.851562 286.851562 212.109375 288.089844 212.511719 289.359375 C 212.921875 290.640625 213.46875 291.671875 214.171875 292.460938 C 215.878906 291.929688 217.578125 291.449219 219.261719 290.988281 C 220.941406 290.53125 222.511719 290.320312 223.960938 290.320312 C 225.410156 290.320312 226.601562 290.679688 227.339844 291.410156 C 228.078125 292.140625 228.449219 293.25 228.449219 294.738281 L 228.449219 296.121094 C 228.078125 296.089844 227.71875 296.058594 227.328125 296.039062 C 225.808594 295.980469 224.539062 295.960938 223.511719 295.960938 C 221.25 295.960938 219.128906 296.359375 217.148438 297.160156 C 215.171875 297.960938 213.570312 299.199219 212.359375 300.890625 C 211.140625 302.570312 210.53125 304.71875 210.53125 307.328125 C 210.53125 308.910156 210.890625 310.46875 211.621094 311.988281 C 212.339844 313.519531 213.441406 314.78125 214.910156 315.78125 C 216.378906 316.78125 218.25 317.28125 220.511719 317.28125 C 222.46875 317.28125 224.179688 316.949219 225.648438 316.289062 C 227.121094 315.628906 228.410156 314.820312 229.519531 313.839844 C 229.761719 313.628906 229.96875 313.421875 230.191406 313.210938 C 230.78125 314.070312 231.488281 314.859375 232.421875 315.511719 C 233.621094 316.339844 235.148438 316.789062 237.019531 316.859375 C 237.660156 316.371094 238.28125 315.640625 238.878906 314.628906 C 239.480469 313.628906 239.878906 312.691406 240.078125 311.808594 C 239.421875 311.300781 238.949219 310.679688 238.660156 309.949219 Z M 223.300781 309.988281 C 222.289062 309.988281 221.5 309.671875 220.929688 309.03125 C 220.359375 308.390625 220.070312 307.601562 220.070312 306.660156 C 220.070312 305.359375 220.421875 304.308594 221.121094 303.5 C 221.820312 302.691406 222.941406 302.28125 224.480469 302.28125 C 225.421875 302.28125 226.570312 302.300781 227.910156 302.339844 C 228.101562 302.339844 228.261719 302.371094 228.441406 302.378906 L 228.441406 307.691406 C 228.121094 307.96875 227.828125 308.300781 227.480469 308.539062 C 226.050781 309.5 224.660156 309.988281 223.300781 309.988281 Z M 223.300781 309.988281 "/>
<path style=" stroke:none;fill-rule:nonzero;fill:rgb(20%,33.72549%,39.607843%);fill-opacity:1;" d="M 256.679688 283.53125 L 256.679688 273.980469 L 256.25 273.550781 L 252.429688 273.550781 C 250.5 273.550781 249.121094 273.988281 248.308594 274.871094 C 247.5 275.75 247.089844 277.28125 247.089844 279.480469 L 247.089844 283.488281 L 241.980469 283.398438 C 241.691406 284.570312 241.550781 285.71875 241.550781 286.859375 C 241.550781 288.109375 241.691406 289.300781 241.980469 290.421875 L 247.089844 290.320312 L 247.089844 307.808594 C 247.089844 310.820312 247.78125 313.039062 249.171875 314.480469 C 250.550781 315.921875 252.691406 316.640625 255.558594 316.640625 C 256.878906 316.640625 258.308594 316.570312 259.839844 316.441406 C 261.378906 316.308594 262.738281 316.160156 263.929688 316.011719 C 264.039062 315.679688 264.109375 315.320312 264.128906 314.921875 C 264.148438 314.519531 264.160156 314.148438 264.160156 313.800781 C 264.160156 312.199219 263.910156 310.640625 263.398438 309.121094 L 259.578125 309.121094 C 258.550781 309.121094 257.808594 308.851562 257.359375 308.308594 C 256.910156 307.769531 256.679688 307.019531 256.679688 306.050781 L 256.679688 290.269531 L 264.558594 290.398438 C 264.851562 289.28125 264.988281 288.089844 264.988281 286.839844 C 264.988281 285.699219 264.851562 284.550781 264.558594 283.378906 L 256.679688 283.511719 Z M 256.679688 283.53125 "/>
<path style=" stroke:none;fill-rule:nonzero;fill:rgb(20%,33.72549%,39.607843%);fill-opacity:1;" d="M 294.378906 289.359375 C 293.300781 287.25 291.75 285.578125 289.71875 284.351562 C 287.691406 283.121094 285.21875 282.511719 282.320312 282.511719 C 278.890625 282.511719 276.109375 283.289062 273.96875 284.851562 C 271.828125 286.410156 270.25 288.511719 269.238281 291.160156 C 268.230469 293.808594 267.71875 296.789062 267.71875 300.109375 C 267.71875 302.308594 267.949219 304.429688 268.398438 306.46875 C 268.851562 308.511719 269.621094 310.351562 270.710938 311.96875 C 271.800781 313.601562 273.28125 314.890625 275.160156 315.839844 C 277.039062 316.800781 279.398438 317.269531 282.261719 317.269531 C 284.589844 317.269531 286.898438 316.949219 289.199219 316.300781 C 291.5 315.648438 293.46875 314.71875 295.109375 313.511719 C 294.960938 312.539062 294.660156 311.511719 294.21875 310.410156 C 293.78125 309.308594 293.199219 308.398438 292.46875 307.679688 C 291.128906 308.25 289.730469 308.738281 288.269531 309.148438 C 286.808594 309.550781 285.328125 309.761719 283.839844 309.761719 C 282.039062 309.761719 280.691406 309.351562 279.800781 308.519531 C 278.910156 307.699219 278.320312 306.621094 278.039062 305.269531 C 277.890625 304.570312 277.789062 303.828125 277.710938 303.058594 L 295.171875 303.058594 C 295.480469 301.980469 295.691406 300.96875 295.808594 300.03125 C 295.929688 299.078125 295.988281 297.910156 295.988281 296.5 C 295.988281 293.839844 295.449219 291.460938 294.378906 289.351562 Z M 286.929688 296.28125 L 277.660156 296.28125 C 277.78125 294.289062 278.109375 292.71875 278.679688 291.621094 C 279.390625 290.21875 280.601562 289.53125 282.289062 289.53125 C 283.410156 289.53125 284.308594 289.808594 284.988281 290.351562 C 285.671875 290.898438 286.160156 291.621094 286.46875 292.53125 C 286.78125 293.429688 286.929688 294.429688 286.929688 295.53125 L 286.929688 296.289062 Z M 286.929688 296.28125 "/>
<path style=" stroke:none;fill-rule:nonzero;fill:rgb(51.764706%,69.803922%,78.039216%);fill-opacity:1;" d="M 168.488281 131.46875 C 169.070312 130.050781 169.699219 128.660156 170.359375 127.308594 C 169.699219 128.660156 169.070312 130.050781 168.488281 131.46875 Z M 168.488281 131.46875 "/>
<path style=" stroke:none;fill-rule:nonzero;fill:rgb(51.764706%,69.803922%,78.039216%);fill-opacity:1;" d="M 173.199219 122.050781 C 174.050781 120.640625 174.941406 119.28125 175.871094 117.960938 C 174.941406 119.28125 174.039062 120.640625 173.199219 122.050781 Z M 173.199219 122.050781 "/>
<path style=" stroke:none;fill-rule:nonzero;fill:rgb(51.764706%,69.803922%,78.039216%);fill-opacity:1;" d="M 170.878906 126.28125 C 171.589844 124.878906 172.328125 123.5 173.121094 122.179688 C 172.328125 123.5 171.589844 124.878906 170.878906 126.28125 Z M 170.878906 126.28125 "/>
<path style=" stroke:none;fill-rule:nonzero;fill:rgb(51.764706%,69.803922%,78.039216%);fill-opacity:1;" d="M 176.371094 117.261719 C 177.210938 116.101562 178.070312 114.980469 178.96875 113.890625 C 178.070312 114.980469 177.210938 116.101562 176.371094 117.261719 Z M 176.371094 117.261719 "/>
<path style=" stroke:none;fill-rule:nonzero;fill:rgb(51.764706%,69.803922%,78.039216%);fill-opacity:1;" d="M 179.320312 113.449219 C 180.359375 112.199219 181.449219 111 182.558594 109.839844 C 181.441406 111 180.359375 112.199219 179.320312 113.449219 Z M 179.320312 113.449219 "/>
<path style=" stroke:none;fill-rule:nonzero;fill:rgb(51.764706%,69.803922%,78.039216%);fill-opacity:1;" d="M 165.089844 142.011719 C 165.441406 140.609375 165.808594 139.238281 166.21875 137.890625 C 165.808594 139.230469 165.429688 140.609375 165.089844 142.011719 Z M 165.089844 142.011719 "/>
<path style=" stroke:none;fill-rule:nonzero;fill:rgb(51.764706%,69.803922%,78.039216%);fill-opacity:1;" d="M 166.589844 136.699219 C 167.121094 135.058594 167.691406 133.449219 168.320312 131.898438 C 167.691406 133.460938 167.128906 135.058594 166.589844 136.699219 Z M 166.589844 136.699219 "/>
<path style=" stroke:none;fill-rule:nonzero;fill:rgb(51.764706%,69.803922%,78.039216%);fill-opacity:1;" d="M 163.03125 154.210938 C 163.179688 152.628906 163.371094 151.078125 163.601562 149.570312 C 163.371094 151.089844 163.179688 152.640625 163.03125 154.210938 Z M 163.03125 154.210938 "/>
<path style=" stroke:none;fill-rule:nonzero;fill:rgb(51.764706%,69.803922%,78.039216%);fill-opacity:1;" d="M 162.578125 161.699219 C 162.621094 159.679688 162.738281 157.710938 162.890625 155.78125 C 162.738281 157.71875 162.621094 159.679688 162.578125 161.699219 Z M 162.578125 161.699219 "/>
<path style=" stroke:none;fill-rule:nonzero;fill:rgb(51.764706%,69.803922%,78.039216%);fill-opacity:1;" d="M 163.75 148.5 C 164.039062 146.691406 164.398438 144.921875 164.789062 143.191406 C 164.390625 144.921875 164.039062 146.691406 163.75 148.5 Z M 163.75 148.5 "/>
<path style=" stroke:none;fill-rule:nonzero;fill:rgb(51.764706%,69.803922%,78.039216%);fill-opacity:1;" d="M 186.421875 106.171875 C 188.820312 104.050781 191.351562 102.109375 193.980469 100.359375 C 191.351562 102.109375 188.820312 104.050781 186.421875 106.171875 Z M 186.421875 106.171875 "/>
<path style=" stroke:none;fill-rule:nonzero;fill:rgb(51.764706%,69.803922%,78.039216%);fill-opacity:1;" d="M 182.710938 109.691406 C 183.78125 108.601562 184.878906 107.550781 186 106.539062 C 184.871094 107.550781 183.769531 108.601562 182.710938 109.691406 Z M 182.710938 109.691406 "/>
<path style=" stroke:none;fill-rule:nonzero;fill:rgb(51.764706%,69.803922%,78.039216%);fill-opacity:1;" d="M 169.328125 193.878906 C 169.660156 194.609375 169.988281 195.339844 170.339844 196.050781 C 170.480469 196.339844 170.628906 196.640625 170.78125 196.929688 C 170.628906 196.640625 170.488281 196.351562 170.339844 196.050781 C 169.988281 195.339844 169.660156 194.609375 169.328125 193.878906 Z M 169.328125 193.878906 "/>
<path style=" stroke:none;fill-rule:nonzero;fill:rgb(51.764706%,69.803922%,78.039216%);fill-opacity:1;" d="M 166.511719 186.480469 C 166.820312 187.449219 167.148438 188.410156 167.5 189.351562 C 167.660156 189.78125 167.808594 190.21875 167.96875 190.640625 C 167.808594 190.21875 167.648438 189.78125 167.5 189.351562 C 167.160156 188.410156 166.820312 187.449219 166.511719 186.480469 Z M 166.511719 186.480469 "/>
<path style=" stroke:none;fill-rule:nonzero;fill:rgb(51.764706%,69.803922%,78.039216%);fill-opacity:1;" d="M 230.730469 235.660156 C 231.929688 235.769531 233.140625 235.910156 234.339844 235.960938 C 234.378906 235.960938 234.410156 235.960938 234.449219 235.960938 C 235.679688 236.011719 236.898438 236.050781 238.121094 236.050781 C 239.339844 236.050781 240.570312 236.019531 241.800781 235.960938 C 241.828125 235.960938 241.859375 235.960938 241.890625 235.960938 C 243.101562 235.898438 244.308594 235.820312 245.519531 235.710938 L 245.519531 155.441406 C 245.519531 150.621094 249.421875 146.71875 254.238281 146.71875 C 259.058594 146.71875 262.960938 150.628906 262.960938 155.441406 L 262.960938 232.21875 C 265.609375 231.378906 268.230469 230.410156 270.789062 229.289062 C 273.351562 228.171875 275.859375 226.910156 278.289062 225.511719 C 277.960938 224.589844 277.738281 223.601562 277.738281 222.558594 L 277.738281 130.519531 C 277.738281 125.699219 281.640625 121.800781 286.460938 121.800781 C 291.28125 121.800781 295.179688 125.710938 295.179688 130.519531 L 295.179688 211.890625 C 295.289062 211.769531 295.398438 211.660156 295.511719 211.539062 C 295.820312 211.191406 296.121094 210.828125 296.429688 210.46875 C 297.058594 209.738281 297.671875 208.988281 298.269531 208.21875 C 298.589844 207.808594 298.898438 207.398438 299.21875 206.980469 C 299.800781 206.199219 300.371094 205.390625 300.921875 204.578125 C 301.191406 204.179688 301.46875 203.789062 301.730469 203.390625 C 302.519531 202.171875 303.289062 200.929688 304.011719 199.640625 C 304.101562 199.480469 304.191406 199.328125 304.28125 199.171875 C 304.691406 198.429688 305.078125 197.679688 305.460938 196.921875 C 305.609375 196.628906 305.75 196.339844 305.898438 196.039062 C 306.25 195.328125 306.578125 194.609375 306.910156 193.871094 C 307.070312 193.5 307.230469 193.128906 307.390625 192.761719 C 307.691406 192.058594 307.988281 191.351562 308.269531 190.628906 C 308.441406 190.199219 308.589844 189.761719 308.75 189.320312 C 309.070312 188.449219 309.378906 187.578125 309.671875 186.679688 C 309.96875 185.761719 310.261719 184.828125 310.53125 183.878906 C 310.679688 183.339844 310.820312 182.78125 310.960938 182.21875 C 311.140625 181.511719 311.328125 180.800781 311.488281 180.070312 C 311.621094 179.511719 311.730469 178.941406 311.851562 178.371094 C 312 177.621094 312.148438 176.871094 312.289062 176.109375 C 312.390625 175.550781 312.480469 174.980469 312.570312 174.410156 C 312.699219 173.601562 312.808594 172.78125 312.921875 171.960938 C 312.988281 171.410156 313.058594 170.871094 313.121094 170.308594 C 313.21875 169.378906 313.300781 168.441406 313.378906 167.488281 C 313.421875 167.019531 313.460938 166.550781 313.488281 166.070312 C 313.578125 164.628906 313.648438 163.179688 313.671875 161.691406 C 312.730469 110.609375 273.871094 87.328125 238.128906 87.328125 C 217.960938 87.328125 207.140625 93.371094 207.140625 93.371094 C 225.71875 110.25 237.390625 134.601562 237.390625 161.679688 C 237.390625 173.851562 235.011719 185.449219 230.730469 196.078125 "/>
<path style=" stroke:none;fill-rule:nonzero;fill:rgb(51.764706%,69.803922%,78.039216%);fill-opacity:1;" d="M 207.160156 230 C 208.328125 230.5 208.21875 230.460938 209.421875 230.898438 C 209.46875 230.921875 209.53125 230.941406 209.578125 230.960938 C 210.800781 231.410156 212.050781 231.78125 213.289062 232.171875 L 213.289062 223.871094 C 211.339844 226 209.300781 228.050781 207.160156 229.988281 C 207.160156 229.988281 207.589844 230.171875 207.160156 229.988281 Z M 207.160156 230 "/>
<path style=" stroke:none;fill-rule:nonzero;fill:rgb(51.764706%,69.803922%,78.039216%);fill-opacity:1;" d="M 171.960938 199.191406 C 172.050781 199.351562 172.140625 199.5 172.230469 199.660156 C 173.5 201.921875 174.878906 204.078125 176.351562 206.128906 C 174.878906 204.078125 173.5 201.929688 172.230469 199.660156 C 172.140625 199.5 172.050781 199.351562 171.960938 199.191406 Z M 171.960938 199.191406 "/>
<path style=" stroke:none;fill-rule:nonzero;fill:rgb(51.764706%,69.803922%,78.039216%);fill-opacity:1;" d="M 163.128906 170.320312 C 163.03125 169.390625 162.949219 168.449219 162.871094 167.511719 C 162.941406 168.460938 163.019531 169.398438 163.128906 170.320312 C 163.191406 170.878906 163.261719 171.429688 163.328125 171.980469 C 163.441406 172.800781 163.550781 173.621094 163.679688 174.429688 C 163.550781 173.621094 163.441406 172.808594 163.328125 171.980469 C 163.261719 171.429688 163.191406 170.878906 163.128906 170.320312 Z M 163.128906 170.320312 "/>
<path style=" stroke:none;fill-rule:nonzero;fill:rgb(51.764706%,69.803922%,78.039216%);fill-opacity:1;" d="M 162.578125 161.699219 C 162.609375 163.191406 162.671875 164.640625 162.761719 166.078125 C 162.789062 166.558594 162.839844 167.03125 162.871094 167.511719 C 162.828125 167.03125 162.789062 166.570312 162.761719 166.078125 C 162.671875 164.640625 162.601562 163.191406 162.578125 161.699219 Z M 162.578125 161.699219 "/>
<path style=" stroke:none;fill-rule:nonzero;fill:rgb(38.431373%,63.529412%,67.843137%);fill-opacity:1;" d="M 164.789062 143.191406 C 164.878906 142.789062 164.988281 142.398438 165.078125 142.011719 C 164.980469 142.398438 164.878906 142.789062 164.789062 143.191406 Z M 164.789062 143.191406 "/>
<path style=" stroke:none;fill-rule:nonzero;fill:rgb(38.431373%,63.529412%,67.843137%);fill-opacity:1;" d="M 202.050781 227.71875 C 203.25 228.308594 204.460938 228.871094 205.691406 229.410156 C 205.75 229.429688 205.808594 229.460938 205.859375 229.480469 C 205.800781 229.460938 205.738281 229.429688 205.691406 229.410156 C 204.460938 228.878906 203.25 228.320312 202.050781 227.71875 Z M 202.050781 227.71875 "/>
<path style=" stroke:none;fill-rule:nonzero;fill:rgb(38.431373%,63.529412%,67.843137%);fill-opacity:1;" d="M 182.539062 200.410156 C 183.171875 199.480469 183.96875 198.679688 184.898438 198.050781 C 183.96875 198.679688 183.171875 199.480469 182.539062 200.410156 Z M 182.539062 200.410156 "/>
<path style=" stroke:none;fill-rule:nonzero;fill:rgb(38.431373%,63.529412%,67.843137%);fill-opacity:1;" d="M 166.21875 137.898438 C 166.339844 137.5 166.460938 137.101562 166.589844 136.699219 C 166.460938 137.101562 166.339844 137.5 166.21875 137.898438 Z M 166.21875 137.898438 "/>
<path style=" stroke:none;fill-rule:nonzero;fill:rgb(38.431373%,63.529412%,67.843137%);fill-opacity:1;" d="M 163.601562 149.570312 C 163.648438 149.21875 163.691406 148.859375 163.75 148.511719 C 163.691406 148.859375 163.648438 149.21875 163.601562 149.570312 Z M 163.601562 149.570312 "/>
<path style=" stroke:none;fill-rule:nonzero;fill:rgb(38.431373%,63.529412%,67.843137%);fill-opacity:1;" d="M 218.609375 172.328125 C 217.570312 172.769531 216.628906 173.410156 215.839844 174.199219 C 216.628906 173.410156 217.570312 172.769531 218.609375 172.328125 Z M 218.609375 172.328125 "/>
<path style=" stroke:none;fill-rule:nonzero;fill:rgb(38.431373%,63.529412%,67.843137%);fill-opacity:1;" d="M 218.609375 172.328125 C 219.648438 171.890625 220.800781 171.640625 222.011719 171.640625 C 220.808594 171.640625 219.660156 171.878906 218.621094 172.328125 Z M 218.609375 172.328125 "/>
<path style=" stroke:none;fill-rule:nonzero;fill:rgb(38.431373%,63.529412%,67.843137%);fill-opacity:1;" d="M 193.980469 100.359375 C 194.078125 100.289062 194.179688 100.230469 194.269531 100.171875 C 194.171875 100.230469 194.070312 100.300781 193.980469 100.359375 Z M 193.980469 100.359375 "/>
<path style=" stroke:none;fill-rule:nonzero;fill:rgb(38.431373%,63.529412%,67.843137%);fill-opacity:1;" d="M 162.890625 155.78125 C 162.929688 155.25 162.980469 154.730469 163.03125 154.210938 C 162.980469 154.730469 162.929688 155.25 162.890625 155.78125 Z M 162.890625 155.78125 "/>
<path style=" stroke:none;fill-rule:nonzero;fill:rgb(38.431373%,63.529412%,67.843137%);fill-opacity:1;" d="M 178.960938 113.890625 C 179.078125 113.738281 179.191406 113.589844 179.308594 113.449219 C 179.191406 113.589844 179.070312 113.738281 178.960938 113.890625 Z M 178.960938 113.890625 "/>
<path style=" stroke:none;fill-rule:nonzero;fill:rgb(38.431373%,63.529412%,67.843137%);fill-opacity:1;" d="M 163.960938 176.128906 C 164.101562 176.890625 164.238281 177.640625 164.398438 178.390625 C 164.519531 178.960938 164.628906 179.53125 164.761719 180.101562 C 164.628906 179.539062 164.519531 178.960938 164.398438 178.390625 C 164.25 177.640625 164.101562 176.890625 163.960938 176.128906 Z M 163.960938 176.128906 "/>
<path style=" stroke:none;fill-rule:nonzero;fill:rgb(38.431373%,63.529412%,67.843137%);fill-opacity:1;" d="M 182.558594 109.839844 C 182.609375 109.789062 182.660156 109.738281 182.710938 109.691406 C 182.660156 109.738281 182.609375 109.789062 182.558594 109.839844 Z M 182.558594 109.839844 "/>
<path style=" stroke:none;fill-rule:nonzero;fill:rgb(38.431373%,63.529412%,67.843137%);fill-opacity:1;" d="M 186.011719 106.539062 C 186.148438 106.421875 186.28125 106.289062 186.421875 106.171875 C 186.28125 106.289062 186.140625 106.421875 186.011719 106.539062 Z M 186.011719 106.539062 "/>
<path style=" stroke:none;fill-rule:nonzero;fill:rgb(38.431373%,63.529412%,67.843137%);fill-opacity:1;" d="M 168.308594 131.898438 C 168.371094 131.761719 168.429688 131.621094 168.488281 131.480469 C 168.429688 131.621094 168.371094 131.761719 168.308594 131.898438 Z M 168.308594 131.898438 "/>
<path style=" stroke:none;fill-rule:nonzero;fill:rgb(38.431373%,63.529412%,67.843137%);fill-opacity:1;" d="M 170.359375 127.308594 C 170.53125 126.960938 170.699219 126.621094 170.871094 126.28125 C 170.699219 126.621094 170.53125 126.960938 170.359375 127.308594 Z M 170.359375 127.308594 "/>
<path style=" stroke:none;fill-rule:nonzero;fill:rgb(38.431373%,63.529412%,67.843137%);fill-opacity:1;" d="M 175.871094 117.949219 C 176.03125 117.71875 176.199219 117.488281 176.371094 117.261719 C 176.199219 117.488281 176.039062 117.710938 175.871094 117.949219 Z M 175.871094 117.949219 "/>
<path style=" stroke:none;fill-rule:nonzero;fill:rgb(38.431373%,63.529412%,67.843137%);fill-opacity:1;" d="M 181.050781 211.941406 L 181.050781 205.289062 C 181.050781 203.480469 181.601562 201.808594 182.539062 200.410156 C 181.601562 201.800781 181.050781 203.480469 181.050781 205.289062 Z M 181.050781 211.941406 "/>
<path style=" stroke:none;fill-rule:nonzero;fill:rgb(38.431373%,63.529412%,67.843137%);fill-opacity:1;" d="M 173.121094 122.191406 C 173.121094 122.191406 173.171875 122.101562 173.199219 122.050781 C 173.171875 122.101562 173.148438 122.140625 173.121094 122.191406 Z M 173.121094 122.191406 "/>
<path style=" stroke:none;fill-rule:nonzero;fill:rgb(38.431373%,63.529412%,67.843137%);fill-opacity:1;" d="M 230.730469 180.371094 L 230.730469 196.109375 C 235.011719 185.480469 237.390625 173.871094 237.390625 161.710938 C 237.390625 134.628906 225.71875 110.28125 207.140625 93.398438 C 202.671875 95.230469 198.351562 97.480469 194.28125 100.171875 C 194.179688 100.230469 194.078125 100.300781 193.988281 100.359375 C 191.359375 102.109375 188.828125 104.050781 186.429688 106.171875 C 186.289062 106.289062 186.148438 106.421875 186.019531 106.539062 C 184.890625 107.550781 183.789062 108.601562 182.730469 109.691406 C 182.679688 109.738281 182.628906 109.789062 182.578125 109.839844 C 181.460938 111 180.378906 112.199219 179.339844 113.449219 C 179.21875 113.589844 179.101562 113.738281 178.988281 113.890625 C 178.089844 114.980469 177.230469 116.101562 176.390625 117.261719 C 176.21875 117.488281 176.058594 117.710938 175.890625 117.949219 C 174.960938 119.269531 174.058594 120.628906 173.21875 122.039062 C 173.191406 122.089844 173.171875 122.128906 173.140625 122.179688 C 172.351562 123.5 171.609375 124.878906 170.898438 126.28125 C 170.730469 126.621094 170.558594 126.960938 170.390625 127.308594 C 169.730469 128.660156 169.101562 130.050781 168.519531 131.46875 C 168.460938 131.609375 168.398438 131.75 168.339844 131.890625 C 167.710938 133.441406 167.148438 135.050781 166.609375 136.691406 C 166.480469 137.089844 166.359375 137.488281 166.238281 137.890625 C 165.828125 139.230469 165.449219 140.609375 165.109375 142.011719 C 165.011719 142.398438 164.910156 142.789062 164.820312 143.191406 C 164.421875 144.921875 164.070312 146.691406 163.78125 148.5 C 163.71875 148.851562 163.679688 149.210938 163.628906 149.558594 C 163.398438 151.078125 163.210938 152.628906 163.058594 154.199219 C 163.011719 154.71875 162.960938 155.238281 162.921875 155.769531 C 162.769531 157.710938 162.648438 159.671875 162.609375 161.691406 C 162.640625 163.179688 162.699219 164.628906 162.789062 166.070312 C 162.820312 166.550781 162.871094 167.019531 162.898438 167.5 C 162.96875 168.449219 163.050781 169.390625 163.160156 170.308594 C 163.21875 170.871094 163.289062 171.421875 163.359375 171.96875 C 163.46875 172.789062 163.578125 173.609375 163.710938 174.421875 C 163.800781 174.988281 163.890625 175.558594 163.988281 176.128906 C 164.128906 176.890625 164.269531 177.640625 164.429688 178.390625 C 164.550781 178.960938 164.660156 179.53125 164.789062 180.101562 C 164.949219 180.820312 165.140625 181.53125 165.320312 182.230469 C 165.460938 182.789062 165.601562 183.351562 165.75 183.898438 C 166 184.78125 166.269531 185.628906 166.539062 186.480469 C 166.851562 187.449219 167.179688 188.410156 167.53125 189.351562 C 167.691406 189.78125 167.839844 190.21875 168 190.640625 C 168.28125 191.359375 168.578125 192.070312 168.878906 192.78125 C 169.039062 193.148438 169.191406 193.519531 169.359375 193.890625 C 169.691406 194.621094 170.019531 195.351562 170.371094 196.058594 C 170.511719 196.351562 170.660156 196.648438 170.808594 196.941406 C 171.191406 197.699219 171.589844 198.460938 171.988281 199.199219 C 172.078125 199.359375 172.171875 199.511719 172.261719 199.671875 C 173.53125 201.929688 174.910156 204.089844 176.378906 206.140625 C 177.851562 208.191406 179.429688 210.128906 181.078125 211.949219 L 181.078125 205.300781 C 181.078125 203.488281 181.628906 201.820312 182.570312 200.421875 C 183.199219 199.488281 184 198.691406 184.929688 198.058594 C 186.320312 197.121094 188 196.570312 189.808594 196.570312 C 194.628906 196.570312 198.53125 200.480469 198.53125 205.289062 L 198.53125 225.851562 C 199.699219 226.511719 200.878906 227.140625 202.078125 227.730469 C 203.28125 228.320312 204.488281 228.878906 205.71875 229.421875 C 205.78125 229.441406 205.839844 229.46875 205.890625 229.488281 C 206.320312 229.671875 206.75 229.828125 207.179688 230.011719 C 209.320312 228.070312 211.359375 226.019531 213.308594 223.890625 L 213.308594 180.378906 C 213.308594 177.96875 214.289062 175.789062 215.859375 174.210938 C 216.648438 173.421875 217.589844 172.78125 218.628906 172.339844 C 219.671875 171.898438 220.820312 171.648438 222.019531 171.648438 C 226.839844 171.648438 230.738281 175.558594 230.738281 180.371094 Z M 230.730469 180.371094 "/>
<path style=" stroke:none;fill-rule:nonzero;fill:rgb(20%,33.72549%,39.607843%);fill-opacity:1;" d="M 331.121094 161.699219 C 331.121094 161.628906 331.121094 161.558594 331.121094 161.480469 C 331.050781 157.640625 330.808594 153.921875 330.398438 150.328125 C 330.371094 150.089844 330.339844 149.859375 330.308594 149.621094 C 330.199219 148.730469 330.070312 147.859375 329.941406 146.988281 C 324.878906 115.410156 303.789062 89.179688 275.269531 76.921875 C 263.351562 72.199219 250.578125 69.898438 238.128906 69.898438 C 230.488281 69.898438 222.730469 70.789062 215.121094 72.539062 C 206.910156 74.71875 199.160156 78.019531 192.011719 82.238281 C 178.269531 74.121094 162.25 69.441406 145.128906 69.441406 C 94.179688 69.441406 52.878906 110.738281 52.878906 161.691406 C 52.878906 212.640625 94.179688 253.941406 145.128906 253.941406 C 162.25 253.941406 178.269531 249.261719 192.011719 241.140625 C 199.140625 245.359375 206.890625 248.648438 215.078125 250.828125 C 220.25 252.019531 225.488281 252.820312 230.71875 253.199219 C 233.191406 253.378906 235.660156 253.480469 238.109375 253.480469 C 241.25 253.480469 244.398438 253.320312 247.558594 253.019531 C 252.519531 252.558594 257.46875 251.738281 262.359375 250.550781 C 266.78125 249.46875 271.140625 248.089844 275.398438 246.398438 C 304.308594 233.910156 325.550781 207.070312 330.148438 174.851562 C 330.679688 170.730469 331.011719 166.441406 331.089844 161.96875 C 331.089844 161.878906 331.089844 161.78125 331.089844 161.691406 Z M 313.488281 166.078125 C 313.460938 166.558594 313.410156 167.03125 313.378906 167.5 C 313.308594 168.449219 313.21875 169.390625 313.121094 170.320312 C 313.058594 170.878906 312.988281 171.421875 312.921875 171.96875 C 312.808594 172.800781 312.699219 173.609375 312.570312 174.421875 C 312.480469 174.988281 312.390625 175.558594 312.289062 176.121094 C 312.148438 176.878906 312 177.640625 311.851562 178.378906 C 311.730469 178.949219 311.621094 179.519531 311.488281 180.078125 C 311.320312 180.808594 311.140625 181.511719 310.960938 182.230469 C 310.820312 182.78125 310.691406 183.339844 310.53125 183.890625 C 310.261719 184.839844 309.96875 185.769531 309.671875 186.691406 C 309.378906 187.578125 309.070312 188.460938 308.75 189.328125 C 308.589844 189.769531 308.441406 190.210938 308.269531 190.640625 C 307.988281 191.359375 307.691406 192.070312 307.390625 192.769531 C 307.230469 193.140625 307.078125 193.511719 306.910156 193.878906 C 306.578125 194.609375 306.25 195.328125 305.898438 196.050781 C 305.761719 196.351562 305.609375 196.640625 305.460938 196.929688 C 305.078125 197.691406 304.691406 198.449219 304.28125 199.179688 C 304.191406 199.339844 304.101562 199.488281 304.011719 199.648438 C 303.289062 200.941406 302.519531 202.179688 301.730469 203.398438 C 301.46875 203.808594 301.191406 204.199219 300.921875 204.589844 C 300.371094 205.410156 299.800781 206.210938 299.21875 206.988281 C 298.910156 207.410156 298.589844 207.820312 298.269531 208.230469 C 297.671875 209 297.050781 209.738281 296.429688 210.480469 C 296.128906 210.839844 295.828125 211.199219 295.511719 211.550781 C 295.398438 211.671875 295.289062 211.78125 295.179688 211.898438 L 295.179688 130.53125 C 295.179688 125.710938 291.28125 121.808594 286.460938 121.808594 C 281.640625 121.808594 277.738281 125.71875 277.738281 130.53125 L 277.738281 222.570312 C 277.738281 223.609375 277.949219 224.589844 278.289062 225.519531 C 275.851562 226.921875 273.351562 228.179688 270.789062 229.300781 C 268.230469 230.421875 265.609375 231.390625 262.960938 232.230469 L 262.960938 155.449219 C 262.960938 150.628906 259.058594 146.730469 254.238281 146.730469 C 249.421875 146.730469 245.519531 150.640625 245.519531 155.449219 L 245.519531 235.71875 C 244.308594 235.828125 243.101562 235.910156 241.890625 235.96875 C 241.859375 235.96875 241.828125 235.96875 241.800781 235.96875 C 240.570312 236.019531 239.339844 236.058594 238.121094 236.058594 C 236.898438 236.058594 235.679688 236.03125 234.449219 235.96875 C 234.410156 235.96875 234.378906 235.96875 234.339844 235.96875 C 233.140625 235.910156 231.941406 235.78125 230.730469 235.671875 L 230.730469 180.378906 C 230.730469 175.558594 226.828125 171.660156 222.011719 171.660156 C 217.191406 171.660156 213.289062 175.570312 213.289062 180.378906 L 213.289062 232.179688 C 212.050781 231.789062 210.800781 231.421875 209.578125 230.96875 C 209.53125 230.949219 209.46875 230.929688 209.421875 230.910156 C 208.660156 230.628906 207.910156 230.308594 207.160156 230.011719 C 206.730469 229.828125 206.289062 229.679688 205.871094 229.488281 C 205.808594 229.46875 205.75 229.441406 205.699219 229.421875 C 203.25 228.359375 200.839844 227.179688 198.511719 225.851562 L 198.511719 205.289062 C 198.511719 200.46875 194.609375 196.570312 189.789062 196.570312 C 184.96875 196.570312 181.070312 200.480469 181.070312 205.289062 L 181.070312 211.941406 C 177.761719 208.28125 174.789062 204.191406 172.238281 199.660156 C 172.148438 199.5 172.058594 199.351562 171.96875 199.191406 C 171.558594 198.449219 171.171875 197.699219 170.789062 196.929688 C 170.640625 196.640625 170.5 196.351562 170.351562 196.050781 C 170 195.339844 169.671875 194.609375 169.339844 193.878906 C 169.179688 193.511719 169.019531 193.140625 168.859375 192.769531 C 168.558594 192.058594 168.261719 191.359375 167.980469 190.628906 C 167.820312 190.210938 167.660156 189.769531 167.511719 189.339844 C 167.171875 188.398438 166.828125 187.441406 166.519531 186.46875 C 166.25 185.621094 165.980469 184.761719 165.730469 183.890625 C 165.578125 183.339844 165.441406 182.78125 165.300781 182.21875 C 165.121094 181.511719 164.929688 180.808594 164.769531 180.089844 C 164.640625 179.53125 164.53125 178.949219 164.410156 178.378906 C 164.261719 177.628906 164.109375 176.878906 163.96875 176.121094 C 163.871094 175.550781 163.78125 174.980469 163.691406 174.410156 C 163.558594 173.601562 163.449219 172.789062 163.339844 171.960938 C 163.269531 171.410156 163.199219 170.859375 163.140625 170.300781 C 163.039062 169.371094 162.960938 168.429688 162.878906 167.488281 C 162.839844 167.011719 162.800781 166.550781 162.769531 166.058594 C 162.679688 164.621094 162.609375 163.171875 162.589844 161.679688 C 163.261719 125.46875 182.988281 103.25 207.148438 93.371094 C 217.070312 89.308594 227.738281 87.328125 238.140625 87.328125 C 273.878906 87.328125 312.738281 110.601562 313.679688 161.691406 C 313.648438 163.179688 313.589844 164.628906 313.5 166.070312 Z M 313.488281 166.078125 "/>
</g>
</svg>
