<?xml version="1.0" encoding="UTF-8"?>
<svg xmlns="http://www.w3.org/2000/svg" xmlns:xlink="http://www.w3.org/1999/xlink" width="48px" height="48px" viewBox="0 0 48 48" version="1.1">
<g id="surface1">
<rect x="0" y="0" width="48" height="48" style="fill:rgb(88.235294%,92.156863%,94.117647%);fill-opacity:1;stroke:none;"/>
<path style=" stroke:none;fill-rule:nonzero;fill:rgb(20%,33.72549%,39.607843%);fill-opacity:1;" d="M 14.550781 35.75 C 14.550781 35.558594 14.53125 35.398438 14.488281 35.25 L 10.300781 35.25 C 10.28125 35.351562 10.269531 35.441406 10.261719 35.539062 C 10.261719 35.640625 10.25 35.71875 10.25 35.800781 C 10.25 35.878906 10.25 35.960938 10.261719 36.050781 C 10.261719 36.140625 10.28125 36.238281 10.300781 36.339844 L 11.199219 36.339844 C 11.269531 36.339844 11.359375 36.339844 11.46875 36.339844 C 11.578125 36.339844 11.671875 36.339844 11.738281 36.339844 C 11.738281 36.460938 11.738281 36.570312 11.738281 36.660156 C 11.738281 36.75 11.738281 36.859375 11.738281 36.96875 L 11.738281 41.101562 C 11.851562 41.121094 11.96875 41.128906 12.078125 41.140625 C 12.199219 41.140625 12.300781 41.140625 12.390625 41.140625 C 12.480469 41.140625 12.589844 41.140625 12.699219 41.140625 C 12.808594 41.140625 12.929688 41.121094 13.039062 41.101562 L 13.039062 36.96875 C 13.039062 36.851562 13.039062 36.75 13.039062 36.660156 C 13.039062 36.570312 13.039062 36.460938 13.039062 36.339844 C 13.101562 36.339844 13.191406 36.339844 13.308594 36.339844 C 13.429688 36.339844 13.511719 36.339844 13.578125 36.339844 L 13.871094 36.339844 C 14.109375 36.339844 14.28125 36.300781 14.390625 36.210938 C 14.5 36.121094 14.558594 35.96875 14.558594 35.761719 Z M 14.550781 35.75 "/>
<path style=" stroke:none;fill-rule:nonzero;fill:rgb(20%,33.72549%,39.607843%);fill-opacity:1;" d="M 17.109375 36.980469 C 16.820312 36.789062 16.460938 36.699219 16.03125 36.699219 C 15.601562 36.699219 15.25 36.789062 14.960938 36.980469 C 14.671875 37.171875 14.449219 37.429688 14.300781 37.769531 C 14.148438 38.109375 14.078125 38.5 14.078125 38.960938 C 14.078125 39.421875 14.148438 39.800781 14.300781 40.140625 C 14.449219 40.480469 14.671875 40.738281 14.960938 40.929688 C 15.25 41.121094 15.609375 41.210938 16.039062 41.210938 C 16.46875 41.210938 16.828125 41.121094 17.121094 40.929688 C 17.410156 40.738281 17.628906 40.480469 17.78125 40.140625 C 17.929688 39.800781 18 39.410156 18 38.949219 C 18 38.488281 17.929688 38.101562 17.78125 37.761719 C 17.628906 37.421875 17.410156 37.160156 17.121094 36.96875 Z M 16.628906 39.609375 C 16.601562 39.808594 16.539062 39.960938 16.449219 40.078125 C 16.359375 40.199219 16.21875 40.261719 16.039062 40.261719 C 15.859375 40.261719 15.71875 40.199219 15.621094 40.078125 C 15.53125 39.960938 15.46875 39.808594 15.429688 39.609375 C 15.398438 39.410156 15.378906 39.199219 15.378906 38.960938 C 15.378906 38.71875 15.398438 38.5 15.429688 38.300781 C 15.460938 38.101562 15.519531 37.941406 15.621094 37.828125 C 15.710938 37.710938 15.851562 37.648438 16.039062 37.648438 C 16.230469 37.648438 16.359375 37.710938 16.449219 37.828125 C 16.539062 37.949219 16.601562 38.101562 16.628906 38.300781 C 16.660156 38.5 16.679688 38.71875 16.679688 38.960938 C 16.679688 39.199219 16.660156 39.421875 16.628906 39.609375 Z M 16.628906 39.609375 "/>
<path style=" stroke:none;fill-rule:nonzero;fill:rgb(20%,33.72549%,39.607843%);fill-opacity:1;" d="M 21.890625 36.980469 C 21.660156 36.789062 21.378906 36.699219 21.03125 36.699219 C 20.75 36.699219 20.5 36.769531 20.269531 36.898438 C 20.128906 36.980469 20.011719 37.078125 19.898438 37.191406 C 19.871094 37.140625 19.851562 37.089844 19.808594 37.050781 C 19.660156 36.859375 19.449219 36.761719 19.191406 36.761719 L 18.851562 36.761719 L 18.789062 36.820312 L 18.789062 42.859375 L 18.851562 42.921875 L 19.351562 42.921875 C 19.601562 42.921875 19.78125 42.859375 19.890625 42.75 C 20 42.640625 20.050781 42.429688 20.050781 42.148438 L 20.050781 40.960938 C 20.050781 40.960938 20.070312 40.96875 20.078125 40.980469 C 20.308594 41.101562 20.570312 41.160156 20.859375 41.160156 C 21.148438 41.160156 21.449219 41.070312 21.710938 40.898438 C 21.96875 40.730469 22.179688 40.46875 22.328125 40.140625 C 22.488281 39.800781 22.558594 39.390625 22.558594 38.898438 C 22.558594 38.46875 22.5 38.089844 22.390625 37.75 C 22.28125 37.421875 22.109375 37.160156 21.878906 36.96875 Z M 21.191406 39.601562 C 21.148438 39.800781 21.078125 39.949219 20.988281 40.050781 C 20.898438 40.160156 20.78125 40.210938 20.640625 40.210938 C 20.488281 40.210938 20.328125 40.160156 20.160156 40.058594 C 20.121094 40.039062 20.078125 40.011719 20.050781 39.988281 L 20.050781 38.089844 C 20.160156 37.960938 20.269531 37.859375 20.378906 37.808594 C 20.511719 37.75 20.621094 37.71875 20.71875 37.71875 C 20.828125 37.71875 20.921875 37.761719 21 37.839844 C 21.078125 37.921875 21.148438 38.050781 21.191406 38.21875 C 21.238281 38.390625 21.261719 38.609375 21.261719 38.890625 C 21.261719 39.171875 21.238281 39.398438 21.191406 39.601562 Z M 21.191406 39.601562 "/>
<path style=" stroke:none;fill-rule:nonzero;fill:rgb(20%,33.72549%,39.607843%);fill-opacity:1;" d="M 25.648438 36.769531 C 25.398438 36.769531 25.191406 36.828125 25.03125 36.941406 C 24.871094 37.050781 24.738281 37.210938 24.640625 37.398438 C 24.609375 37.449219 24.601562 37.5 24.570312 37.558594 C 24.519531 37.429688 24.460938 37.308594 24.378906 37.210938 C 24.191406 36.949219 23.898438 36.808594 23.519531 36.769531 C 23.441406 36.828125 23.359375 36.929688 23.28125 37.058594 C 23.199219 37.191406 23.148438 37.308594 23.121094 37.429688 C 23.191406 37.480469 23.261719 37.578125 23.339844 37.730469 C 23.421875 37.878906 23.449219 38.070312 23.449219 38.320312 L 23.449219 41.101562 C 23.640625 41.128906 23.859375 41.148438 24.089844 41.148438 C 24.320312 41.148438 24.539062 41.128906 24.730469 41.101562 L 24.730469 38.421875 C 24.78125 38.351562 24.828125 38.28125 24.878906 38.21875 C 24.960938 38.140625 25.039062 38.070312 25.140625 38.03125 C 25.238281 37.980469 25.339844 37.960938 25.460938 37.960938 C 25.53125 37.960938 25.609375 37.980469 25.679688 37.988281 C 25.75 38 25.820312 38.019531 25.890625 38.039062 C 26 37.859375 26.078125 37.660156 26.128906 37.429688 C 26.179688 37.199219 26.210938 37.011719 26.210938 36.859375 C 26.128906 36.839844 26.050781 36.820312 25.96875 36.808594 C 25.890625 36.800781 25.789062 36.789062 25.671875 36.789062 Z M 25.648438 36.769531 "/>
<path style=" stroke:none;fill-rule:nonzero;fill:rgb(20%,33.72549%,39.607843%);fill-opacity:1;" d="M 30.050781 40.261719 C 30.011719 40.160156 29.988281 40.050781 29.988281 39.921875 L 29.988281 38.179688 C 29.988281 37.820312 29.921875 37.539062 29.769531 37.328125 C 29.621094 37.121094 29.441406 36.960938 29.210938 36.871094 C 28.980469 36.78125 28.738281 36.730469 28.488281 36.730469 C 28.300781 36.730469 28.101562 36.75 27.871094 36.78125 C 27.640625 36.808594 27.410156 36.859375 27.179688 36.910156 C 26.949219 36.960938 26.738281 37.03125 26.550781 37.109375 C 26.558594 37.269531 26.601562 37.429688 26.648438 37.589844 C 26.699219 37.761719 26.769531 37.890625 26.871094 37.988281 C 27.089844 37.921875 27.308594 37.859375 27.53125 37.800781 C 27.75 37.738281 27.949219 37.710938 28.140625 37.710938 C 28.328125 37.710938 28.480469 37.761719 28.578125 37.851562 C 28.679688 37.941406 28.71875 38.089844 28.71875 38.28125 L 28.71875 38.460938 C 28.71875 38.460938 28.628906 38.460938 28.570312 38.449219 C 28.371094 38.449219 28.210938 38.441406 28.070312 38.441406 C 27.78125 38.441406 27.5 38.488281 27.25 38.601562 C 26.988281 38.699219 26.789062 38.871094 26.628906 39.078125 C 26.46875 39.300781 26.390625 39.578125 26.390625 39.921875 C 26.390625 40.128906 26.441406 40.328125 26.53125 40.519531 C 26.621094 40.71875 26.769531 40.878906 26.960938 41.011719 C 27.148438 41.140625 27.390625 41.199219 27.691406 41.199219 C 27.941406 41.199219 28.171875 41.160156 28.359375 41.070312 C 28.550781 40.980469 28.71875 40.878906 28.859375 40.75 C 28.890625 40.71875 28.921875 40.699219 28.949219 40.671875 C 29.03125 40.78125 29.121094 40.878906 29.238281 40.96875 C 29.398438 41.078125 29.589844 41.140625 29.839844 41.148438 C 29.921875 41.089844 30 40.988281 30.078125 40.859375 C 30.160156 40.730469 30.210938 40.609375 30.238281 40.488281 C 30.148438 40.421875 30.089844 40.339844 30.058594 40.25 Z M 28.058594 40.261719 C 27.929688 40.261719 27.828125 40.21875 27.75 40.140625 C 27.679688 40.058594 27.640625 39.960938 27.640625 39.828125 C 27.640625 39.660156 27.691406 39.53125 27.78125 39.421875 C 27.871094 39.308594 28.019531 39.261719 28.21875 39.261719 C 28.339844 39.261719 28.488281 39.261719 28.660156 39.261719 C 28.679688 39.261719 28.699219 39.261719 28.730469 39.261719 L 28.730469 39.949219 C 28.730469 39.949219 28.648438 40.03125 28.609375 40.058594 C 28.421875 40.191406 28.238281 40.25 28.070312 40.25 Z M 28.058594 40.261719 "/>
<path style=" stroke:none;fill-rule:nonzero;fill:rgb(20%,33.72549%,39.607843%);fill-opacity:1;" d="M 32.390625 36.828125 L 32.390625 35.589844 L 32.328125 35.53125 L 31.828125 35.53125 C 31.578125 35.53125 31.398438 35.589844 31.300781 35.699219 C 31.199219 35.808594 31.140625 36.011719 31.140625 36.300781 L 31.140625 36.820312 L 30.480469 36.820312 C 30.441406 36.960938 30.421875 37.109375 30.421875 37.261719 C 30.421875 37.421875 30.441406 37.578125 30.480469 37.71875 L 31.140625 37.71875 C 31.140625 37.71875 31.140625 39.980469 31.140625 39.980469 C 31.140625 40.371094 31.230469 40.660156 31.410156 40.851562 C 31.589844 41.039062 31.871094 41.128906 32.238281 41.128906 C 32.410156 41.128906 32.601562 41.128906 32.800781 41.101562 C 33 41.078125 33.179688 41.058594 33.328125 41.039062 C 33.339844 41 33.351562 40.949219 33.359375 40.898438 C 33.371094 40.851562 33.359375 40.800781 33.359375 40.75 C 33.359375 40.539062 33.328125 40.339844 33.261719 40.140625 L 32.761719 40.140625 C 32.628906 40.140625 32.53125 40.109375 32.46875 40.039062 C 32.410156 39.96875 32.378906 39.871094 32.378906 39.75 L 32.378906 37.699219 L 33.398438 37.71875 C 33.441406 37.570312 33.460938 37.421875 33.460938 37.261719 C 33.460938 37.109375 33.441406 36.960938 33.398438 36.808594 L 32.378906 36.828125 Z M 32.390625 36.828125 "/>
<path style=" stroke:none;fill-rule:nonzero;fill:rgb(20%,33.72549%,39.607843%);fill-opacity:1;" d="M 37.28125 37.589844 C 37.140625 37.320312 36.941406 37.101562 36.679688 36.941406 C 36.421875 36.78125 36.101562 36.699219 35.71875 36.699219 C 35.28125 36.699219 34.910156 36.800781 34.640625 37 C 34.359375 37.199219 34.160156 37.480469 34.03125 37.820312 C 33.898438 38.160156 33.828125 38.550781 33.828125 38.980469 C 33.828125 39.269531 33.859375 39.539062 33.921875 39.800781 C 33.980469 40.058594 34.078125 40.300781 34.21875 40.511719 C 34.359375 40.71875 34.550781 40.890625 34.800781 41.011719 C 35.039062 41.128906 35.351562 41.199219 35.71875 41.199219 C 36.019531 41.199219 36.320312 41.160156 36.621094 41.070312 C 36.921875 40.988281 37.171875 40.871094 37.390625 40.710938 C 37.371094 40.578125 37.328125 40.449219 37.269531 40.308594 C 37.210938 40.171875 37.140625 40.050781 37.039062 39.960938 C 36.871094 40.03125 36.679688 40.101562 36.5 40.148438 C 36.308594 40.199219 36.121094 40.230469 35.929688 40.230469 C 35.699219 40.230469 35.519531 40.179688 35.410156 40.070312 C 35.289062 39.960938 35.21875 39.820312 35.179688 39.648438 C 35.160156 39.558594 35.148438 39.460938 35.140625 39.359375 L 37.398438 39.359375 C 37.441406 39.21875 37.46875 39.089844 37.480469 38.96875 C 37.5 38.851562 37.5 38.691406 37.5 38.511719 C 37.5 38.171875 37.429688 37.859375 37.289062 37.578125 Z M 36.308594 38.488281 L 35.109375 38.488281 C 35.128906 38.230469 35.171875 38.03125 35.238281 37.890625 C 35.328125 37.710938 35.488281 37.621094 35.710938 37.621094 C 35.859375 37.621094 35.96875 37.660156 36.058594 37.730469 C 36.148438 37.800781 36.210938 37.898438 36.25 38.011719 C 36.289062 38.128906 36.308594 38.261719 36.308594 38.398438 L 36.308594 38.5 Z M 36.308594 38.488281 "/>
<path style=" stroke:none;fill-rule:nonzero;fill:rgb(51.764706%,69.803922%,78.039216%);fill-opacity:1;" d="M 20.949219 17.109375 C 21.03125 16.929688 21.109375 16.75 21.191406 16.570312 C 21.101562 16.75 21.019531 16.921875 20.949219 17.109375 Z M 20.949219 17.109375 "/>
<path style=" stroke:none;fill-rule:nonzero;fill:rgb(51.764706%,69.803922%,78.039216%);fill-opacity:1;" d="M 21.558594 15.890625 C 21.671875 15.710938 21.789062 15.53125 21.910156 15.359375 C 21.789062 15.53125 21.671875 15.710938 21.558594 15.890625 Z M 21.558594 15.890625 "/>
<path style=" stroke:none;fill-rule:nonzero;fill:rgb(51.764706%,69.803922%,78.039216%);fill-opacity:1;" d="M 21.261719 16.441406 C 21.351562 16.261719 21.449219 16.078125 21.550781 15.910156 C 21.449219 16.078125 21.351562 16.261719 21.261719 16.441406 Z M 21.261719 16.441406 "/>
<path style=" stroke:none;fill-rule:nonzero;fill:rgb(51.764706%,69.803922%,78.039216%);fill-opacity:1;" d="M 21.96875 15.269531 C 22.078125 15.121094 22.191406 14.96875 22.308594 14.828125 C 22.191406 14.96875 22.078125 15.121094 21.96875 15.269531 Z M 21.96875 15.269531 "/>
<path style=" stroke:none;fill-rule:nonzero;fill:rgb(51.764706%,69.803922%,78.039216%);fill-opacity:1;" d="M 22.359375 14.769531 C 22.5 14.609375 22.640625 14.449219 22.78125 14.300781 C 22.628906 14.449219 22.488281 14.609375 22.359375 14.769531 Z M 22.359375 14.769531 "/>
<path style=" stroke:none;fill-rule:nonzero;fill:rgb(51.764706%,69.803922%,78.039216%);fill-opacity:1;" d="M 20.511719 18.480469 C 20.550781 18.300781 20.601562 18.121094 20.660156 17.949219 C 20.609375 18.121094 20.558594 18.300781 20.511719 18.480469 Z M 20.511719 18.480469 "/>
<path style=" stroke:none;fill-rule:nonzero;fill:rgb(51.764706%,69.803922%,78.039216%);fill-opacity:1;" d="M 20.699219 17.789062 C 20.769531 17.578125 20.839844 17.371094 20.921875 17.171875 C 20.839844 17.371094 20.769531 17.578125 20.699219 17.789062 Z M 20.699219 17.789062 "/>
<path style=" stroke:none;fill-rule:nonzero;fill:rgb(51.764706%,69.803922%,78.039216%);fill-opacity:1;" d="M 20.238281 20.058594 C 20.261719 19.859375 20.28125 19.648438 20.308594 19.460938 C 20.28125 19.660156 20.261719 19.859375 20.238281 20.058594 Z M 20.238281 20.058594 "/>
<path style=" stroke:none;fill-rule:nonzero;fill:rgb(51.764706%,69.803922%,78.039216%);fill-opacity:1;" d="M 20.179688 21.03125 C 20.179688 20.769531 20.199219 20.511719 20.21875 20.261719 C 20.199219 20.511719 20.179688 20.769531 20.179688 21.03125 Z M 20.179688 21.03125 "/>
<path style=" stroke:none;fill-rule:nonzero;fill:rgb(51.764706%,69.803922%,78.039216%);fill-opacity:1;" d="M 20.339844 19.320312 C 20.378906 19.078125 20.421875 18.859375 20.480469 18.628906 C 20.429688 18.851562 20.378906 19.078125 20.339844 19.320312 Z M 20.339844 19.320312 "/>
<path style=" stroke:none;fill-rule:nonzero;fill:rgb(51.764706%,69.803922%,78.039216%);fill-opacity:1;" d="M 23.28125 13.828125 C 23.589844 13.550781 23.921875 13.300781 24.261719 13.078125 C 23.921875 13.308594 23.589844 13.558594 23.28125 13.828125 Z M 23.28125 13.828125 "/>
<path style=" stroke:none;fill-rule:nonzero;fill:rgb(51.764706%,69.803922%,78.039216%);fill-opacity:1;" d="M 22.800781 14.289062 C 22.941406 14.148438 23.078125 14.011719 23.230469 13.878906 C 23.078125 14.011719 22.941406 14.148438 22.800781 14.289062 Z M 22.800781 14.289062 "/>
<path style=" stroke:none;fill-rule:nonzero;fill:rgb(51.764706%,69.803922%,78.039216%);fill-opacity:1;" d="M 21.058594 25.210938 C 21.101562 25.308594 21.148438 25.398438 21.191406 25.488281 C 21.210938 25.53125 21.230469 25.570312 21.25 25.601562 C 21.230469 25.558594 21.210938 25.519531 21.191406 25.488281 C 21.148438 25.398438 21.101562 25.300781 21.058594 25.210938 Z M 21.058594 25.210938 "/>
<path style=" stroke:none;fill-rule:nonzero;fill:rgb(51.764706%,69.803922%,78.039216%);fill-opacity:1;" d="M 20.691406 24.25 C 20.730469 24.378906 20.769531 24.5 20.820312 24.621094 C 20.839844 24.679688 20.859375 24.730469 20.878906 24.789062 C 20.859375 24.738281 20.839844 24.679688 20.820312 24.621094 C 20.78125 24.5 20.730469 24.371094 20.691406 24.25 Z M 20.691406 24.25 "/>
<path style=" stroke:none;fill-rule:nonzero;fill:rgb(51.764706%,69.803922%,78.039216%);fill-opacity:1;" d="M 29.019531 30.628906 C 29.179688 30.640625 29.328125 30.660156 29.488281 30.671875 C 29.488281 30.671875 29.488281 30.671875 29.5 30.671875 C 29.660156 30.671875 29.820312 30.679688 29.980469 30.679688 C 30.140625 30.679688 30.300781 30.679688 30.460938 30.671875 C 30.460938 30.671875 30.460938 30.671875 30.46875 30.671875 C 30.628906 30.671875 30.78125 30.648438 30.941406 30.640625 L 30.941406 20.230469 C 30.941406 19.609375 31.449219 19.101562 32.070312 19.101562 C 32.691406 19.101562 33.199219 19.609375 33.199219 20.230469 L 33.199219 30.191406 C 33.539062 30.078125 33.878906 29.949219 34.21875 29.808594 C 34.550781 29.660156 34.878906 29.5 35.191406 29.320312 C 35.148438 29.199219 35.121094 29.070312 35.121094 28.941406 L 35.121094 17 C 35.121094 16.378906 35.628906 15.871094 36.25 15.871094 C 36.871094 15.871094 37.378906 16.378906 37.378906 17 L 37.378906 27.550781 C 37.378906 27.550781 37.410156 27.519531 37.421875 27.5 C 37.460938 27.449219 37.5 27.410156 37.539062 27.359375 C 37.621094 27.261719 37.699219 27.171875 37.78125 27.070312 C 37.820312 27.019531 37.859375 26.960938 37.898438 26.910156 C 37.980469 26.808594 38.050781 26.699219 38.121094 26.601562 C 38.160156 26.550781 38.191406 26.5 38.21875 26.449219 C 38.320312 26.289062 38.421875 26.128906 38.519531 25.960938 C 38.53125 25.941406 38.539062 25.921875 38.550781 25.898438 C 38.601562 25.800781 38.648438 25.710938 38.699219 25.609375 C 38.71875 25.570312 38.738281 25.53125 38.761719 25.5 C 38.800781 25.410156 38.851562 25.308594 38.890625 25.21875 C 38.910156 25.171875 38.929688 25.121094 38.949219 25.078125 C 38.988281 24.988281 39.03125 24.898438 39.058594 24.800781 C 39.078125 24.738281 39.101562 24.691406 39.121094 24.628906 C 39.160156 24.519531 39.199219 24.398438 39.238281 24.289062 C 39.28125 24.171875 39.320312 24.050781 39.351562 23.929688 C 39.371094 23.859375 39.390625 23.789062 39.410156 23.71875 C 39.429688 23.628906 39.460938 23.539062 39.480469 23.441406 C 39.5 23.371094 39.511719 23.289062 39.53125 23.21875 C 39.550781 23.121094 39.570312 23.03125 39.589844 22.929688 C 39.601562 22.859375 39.621094 22.78125 39.628906 22.710938 C 39.648438 22.609375 39.660156 22.5 39.671875 22.390625 C 39.671875 22.320312 39.691406 22.25 39.699219 22.179688 C 39.710938 22.058594 39.71875 21.941406 39.730469 21.808594 C 39.730469 21.75 39.738281 21.691406 39.738281 21.628906 C 39.75 21.441406 39.761719 21.25 39.761719 21.058594 C 39.640625 14.429688 34.601562 11.421875 29.960938 11.421875 C 27.339844 11.421875 25.941406 12.199219 25.941406 12.199219 C 28.351562 14.390625 29.859375 17.550781 29.859375 21.058594 C 29.859375 22.640625 29.550781 24.140625 29 25.519531 "/>
<path style=" stroke:none;fill-rule:nonzero;fill:rgb(51.764706%,69.803922%,78.039216%);fill-opacity:1;" d="M 25.96875 29.890625 C 26.121094 29.960938 26.109375 29.949219 26.261719 30.011719 C 26.261719 30.011719 26.269531 30.011719 26.28125 30.011719 C 26.441406 30.070312 26.601562 30.121094 26.761719 30.171875 L 26.761719 29.089844 C 26.511719 29.371094 26.238281 29.628906 25.960938 29.878906 C 25.960938 29.878906 26.019531 29.898438 25.960938 29.878906 Z M 25.96875 29.890625 "/>
<path style=" stroke:none;fill-rule:nonzero;fill:rgb(51.764706%,69.803922%,78.039216%);fill-opacity:1;" d="M 21.398438 25.890625 C 21.398438 25.890625 21.421875 25.929688 21.429688 25.949219 C 21.589844 26.238281 21.769531 26.519531 21.960938 26.789062 C 21.769531 26.519531 21.589844 26.238281 21.429688 25.949219 C 21.421875 25.929688 21.410156 25.910156 21.398438 25.890625 Z M 21.398438 25.890625 "/>
<path style=" stroke:none;fill-rule:nonzero;fill:rgb(51.764706%,69.803922%,78.039216%);fill-opacity:1;" d="M 20.261719 22.148438 C 20.25 22.03125 20.238281 21.910156 20.230469 21.789062 C 20.230469 21.910156 20.25 22.03125 20.261719 22.148438 C 20.261719 22.21875 20.28125 22.289062 20.289062 22.371094 C 20.300781 22.480469 20.320312 22.578125 20.328125 22.691406 C 20.308594 22.589844 20.300781 22.480469 20.289062 22.371094 C 20.289062 22.300781 20.269531 22.230469 20.261719 22.148438 Z M 20.261719 22.148438 "/>
<path style=" stroke:none;fill-rule:nonzero;fill:rgb(51.764706%,69.803922%,78.039216%);fill-opacity:1;" d="M 20.179688 21.03125 C 20.179688 21.21875 20.191406 21.410156 20.199219 21.601562 C 20.199219 21.660156 20.199219 21.71875 20.210938 21.78125 C 20.210938 21.71875 20.199219 21.660156 20.199219 21.601562 C 20.191406 21.410156 20.179688 21.21875 20.179688 21.03125 Z M 20.179688 21.03125 "/>
<path style=" stroke:none;fill-rule:nonzero;fill:rgb(38.431373%,63.529412%,67.843137%);fill-opacity:1;" d="M 20.46875 18.628906 C 20.480469 18.578125 20.5 18.53125 20.511719 18.480469 C 20.5 18.53125 20.480469 18.578125 20.46875 18.628906 Z M 20.46875 18.628906 "/>
<path style=" stroke:none;fill-rule:nonzero;fill:rgb(38.431373%,63.529412%,67.843137%);fill-opacity:1;" d="M 25.300781 29.601562 C 25.460938 29.679688 25.609375 29.75 25.769531 29.820312 C 25.769531 29.820312 25.78125 29.820312 25.789062 29.820312 C 25.789062 29.820312 25.769531 29.820312 25.769531 29.820312 C 25.609375 29.75 25.449219 29.679688 25.300781 29.601562 Z M 25.300781 29.601562 "/>
<path style=" stroke:none;fill-rule:nonzero;fill:rgb(38.431373%,63.529412%,67.843137%);fill-opacity:1;" d="M 22.769531 26.050781 C 22.851562 25.929688 22.960938 25.828125 23.078125 25.738281 C 22.960938 25.820312 22.859375 25.929688 22.769531 26.050781 Z M 22.769531 26.050781 "/>
<path style=" stroke:none;fill-rule:nonzero;fill:rgb(38.431373%,63.529412%,67.843137%);fill-opacity:1;" d="M 20.660156 17.941406 C 20.679688 17.890625 20.691406 17.839844 20.710938 17.78125 C 20.691406 17.828125 20.679688 17.878906 20.660156 17.941406 Z M 20.660156 17.941406 "/>
<path style=" stroke:none;fill-rule:nonzero;fill:rgb(38.431373%,63.529412%,67.843137%);fill-opacity:1;" d="M 20.320312 19.460938 C 20.320312 19.460938 20.328125 19.371094 20.339844 19.320312 C 20.339844 19.371094 20.328125 19.410156 20.320312 19.460938 Z M 20.320312 19.460938 "/>
<path style=" stroke:none;fill-rule:nonzero;fill:rgb(38.431373%,63.529412%,67.843137%);fill-opacity:1;" d="M 27.449219 22.410156 C 27.308594 22.46875 27.191406 22.550781 27.089844 22.648438 C 27.191406 22.550781 27.308594 22.460938 27.449219 22.410156 Z M 27.449219 22.410156 "/>
<path style=" stroke:none;fill-rule:nonzero;fill:rgb(38.431373%,63.529412%,67.843137%);fill-opacity:1;" d="M 27.449219 22.410156 C 27.589844 22.351562 27.730469 22.320312 27.890625 22.320312 C 27.730469 22.320312 27.578125 22.351562 27.449219 22.410156 Z M 27.449219 22.410156 "/>
<path style=" stroke:none;fill-rule:nonzero;fill:rgb(38.431373%,63.529412%,67.843137%);fill-opacity:1;" d="M 24.261719 13.078125 C 24.261719 13.078125 24.289062 13.058594 24.300781 13.050781 C 24.289062 13.050781 24.269531 13.070312 24.261719 13.078125 Z M 24.261719 13.078125 "/>
<path style=" stroke:none;fill-rule:nonzero;fill:rgb(38.431373%,63.529412%,67.843137%);fill-opacity:1;" d="M 20.21875 20.261719 C 20.21875 20.191406 20.230469 20.121094 20.238281 20.058594 C 20.238281 20.128906 20.230469 20.199219 20.21875 20.261719 Z M 20.21875 20.261719 "/>
<path style=" stroke:none;fill-rule:nonzero;fill:rgb(38.431373%,63.529412%,67.843137%);fill-opacity:1;" d="M 22.308594 14.828125 C 22.308594 14.828125 22.339844 14.789062 22.359375 14.769531 C 22.339844 14.789062 22.328125 14.808594 22.308594 14.828125 Z M 22.308594 14.828125 "/>
<path style=" stroke:none;fill-rule:nonzero;fill:rgb(38.431373%,63.529412%,67.843137%);fill-opacity:1;" d="M 20.359375 22.898438 C 20.378906 23 20.398438 23.101562 20.421875 23.191406 C 20.441406 23.261719 20.449219 23.339844 20.46875 23.410156 C 20.449219 23.339844 20.441406 23.261719 20.421875 23.191406 C 20.398438 23.089844 20.378906 23 20.359375 22.898438 Z M 20.359375 22.898438 "/>
<path style=" stroke:none;fill-rule:nonzero;fill:rgb(38.431373%,63.529412%,67.843137%);fill-opacity:1;" d="M 22.78125 14.308594 C 22.78125 14.308594 22.789062 14.300781 22.800781 14.289062 C 22.800781 14.289062 22.789062 14.300781 22.78125 14.308594 Z M 22.78125 14.308594 "/>
<path style=" stroke:none;fill-rule:nonzero;fill:rgb(38.431373%,63.529412%,67.843137%);fill-opacity:1;" d="M 23.21875 13.878906 C 23.21875 13.878906 23.261719 13.851562 23.269531 13.828125 C 23.25 13.851562 23.230469 13.859375 23.21875 13.878906 Z M 23.21875 13.878906 "/>
<path style=" stroke:none;fill-rule:nonzero;fill:rgb(38.431373%,63.529412%,67.843137%);fill-opacity:1;" d="M 20.929688 17.171875 C 20.929688 17.171875 20.949219 17.128906 20.949219 17.121094 C 20.949219 17.140625 20.929688 17.160156 20.929688 17.171875 Z M 20.929688 17.171875 "/>
<path style=" stroke:none;fill-rule:nonzero;fill:rgb(38.431373%,63.529412%,67.843137%);fill-opacity:1;" d="M 21.191406 16.570312 C 21.191406 16.570312 21.230469 16.480469 21.261719 16.441406 C 21.238281 16.480469 21.21875 16.53125 21.191406 16.570312 Z M 21.191406 16.570312 "/>
<path style=" stroke:none;fill-rule:nonzero;fill:rgb(38.431373%,63.529412%,67.843137%);fill-opacity:1;" d="M 21.910156 15.359375 C 21.910156 15.359375 21.949219 15.300781 21.96875 15.269531 C 21.949219 15.300781 21.929688 15.328125 21.910156 15.359375 Z M 21.910156 15.359375 "/>
<path style=" stroke:none;fill-rule:nonzero;fill:rgb(38.431373%,63.529412%,67.843137%);fill-opacity:1;" d="M 22.578125 27.550781 L 22.578125 26.691406 C 22.578125 26.460938 22.648438 26.238281 22.769531 26.058594 C 22.648438 26.238281 22.578125 26.460938 22.578125 26.691406 Z M 22.578125 27.550781 "/>
<path style=" stroke:none;fill-rule:nonzero;fill:rgb(38.431373%,63.529412%,67.843137%);fill-opacity:1;" d="M 21.550781 15.910156 C 21.550781 15.910156 21.550781 15.898438 21.558594 15.890625 C 21.558594 15.890625 21.558594 15.898438 21.550781 15.910156 Z M 21.550781 15.910156 "/>
<path style=" stroke:none;fill-rule:nonzero;fill:rgb(38.431373%,63.529412%,67.843137%);fill-opacity:1;" d="M 29.019531 23.449219 L 29.019531 25.488281 C 29.570312 24.109375 29.878906 22.609375 29.878906 21.03125 C 29.878906 17.519531 28.371094 14.359375 25.960938 12.171875 C 25.378906 12.410156 24.820312 12.699219 24.289062 13.050781 C 24.28125 13.050781 24.261719 13.070312 24.25 13.078125 C 23.910156 13.308594 23.578125 13.558594 23.269531 13.828125 C 23.25 13.851562 23.230469 13.859375 23.21875 13.878906 C 23.070312 14.011719 22.929688 14.148438 22.789062 14.289062 C 22.789062 14.289062 22.78125 14.300781 22.769531 14.308594 C 22.621094 14.460938 22.480469 14.621094 22.351562 14.78125 C 22.328125 14.800781 22.320312 14.820312 22.300781 14.839844 C 22.179688 14.980469 22.070312 15.128906 21.960938 15.28125 C 21.941406 15.308594 21.921875 15.339844 21.898438 15.371094 C 21.78125 15.539062 21.660156 15.71875 21.550781 15.898438 C 21.550781 15.898438 21.550781 15.910156 21.539062 15.921875 C 21.441406 16.089844 21.339844 16.269531 21.25 16.449219 C 21.230469 16.488281 21.210938 16.539062 21.179688 16.578125 C 21.089844 16.761719 21.011719 16.929688 20.941406 17.121094 C 20.941406 17.140625 20.921875 17.160156 20.921875 17.171875 C 20.839844 17.371094 20.769531 17.578125 20.699219 17.789062 C 20.679688 17.839844 20.671875 17.890625 20.648438 17.949219 C 20.601562 18.121094 20.550781 18.300781 20.5 18.480469 C 20.488281 18.53125 20.46875 18.578125 20.460938 18.628906 C 20.410156 18.851562 20.359375 19.078125 20.320312 19.320312 C 20.320312 19.371094 20.308594 19.410156 20.300781 19.460938 C 20.269531 19.660156 20.25 19.859375 20.230469 20.058594 C 20.230469 20.128906 20.21875 20.199219 20.210938 20.261719 C 20.191406 20.511719 20.171875 20.769531 20.171875 21.03125 C 20.171875 21.21875 20.179688 21.410156 20.191406 21.601562 C 20.191406 21.660156 20.191406 21.71875 20.199219 21.78125 C 20.199219 21.898438 20.21875 22.019531 20.230469 22.140625 C 20.230469 22.210938 20.25 22.28125 20.261719 22.359375 C 20.269531 22.46875 20.289062 22.570312 20.300781 22.679688 C 20.308594 22.75 20.320312 22.828125 20.339844 22.898438 C 20.359375 23 20.378906 23.101562 20.398438 23.191406 C 20.421875 23.261719 20.429688 23.339844 20.449219 23.410156 C 20.46875 23.5 20.5 23.601562 20.519531 23.691406 C 20.539062 23.761719 20.558594 23.839844 20.578125 23.910156 C 20.609375 24.019531 20.648438 24.128906 20.679688 24.238281 C 20.71875 24.371094 20.761719 24.488281 20.808594 24.609375 C 20.828125 24.671875 20.851562 24.71875 20.871094 24.78125 C 20.910156 24.871094 20.949219 24.96875 20.980469 25.058594 C 21 25.109375 21.019531 25.160156 21.039062 25.199219 C 21.078125 25.300781 21.128906 25.390625 21.171875 25.480469 C 21.191406 25.519531 21.210938 25.558594 21.230469 25.589844 C 21.28125 25.691406 21.328125 25.789062 21.378906 25.878906 C 21.390625 25.898438 21.398438 25.921875 21.410156 25.941406 C 21.570312 26.230469 21.75 26.511719 21.941406 26.78125 C 22.128906 27.050781 22.328125 27.300781 22.550781 27.53125 L 22.550781 26.671875 C 22.550781 26.441406 22.621094 26.21875 22.738281 26.039062 C 22.820312 25.921875 22.929688 25.820312 23.050781 25.730469 C 23.230469 25.609375 23.449219 25.539062 23.679688 25.539062 C 24.300781 25.539062 24.808594 26.050781 24.808594 26.671875 L 24.808594 29.339844 C 24.960938 29.429688 25.121094 29.511719 25.269531 29.578125 C 25.429688 29.660156 25.578125 29.730469 25.738281 29.800781 C 25.738281 29.800781 25.761719 29.800781 25.761719 29.800781 C 25.820312 29.820312 25.871094 29.839844 25.929688 29.871094 C 26.210938 29.621094 26.46875 29.351562 26.730469 29.078125 L 26.730469 23.441406 C 26.730469 23.128906 26.859375 22.839844 27.058594 22.640625 C 27.160156 22.539062 27.28125 22.449219 27.421875 22.398438 C 27.558594 22.339844 27.699219 22.308594 27.859375 22.308594 C 28.480469 22.308594 28.988281 22.820312 28.988281 23.441406 Z M 29.019531 23.449219 "/>
<path style=" stroke:none;fill-rule:nonzero;fill:rgb(20%,33.72549%,39.607843%);fill-opacity:1;" d="M 42.039062 21.03125 C 42.039062 21.03125 42.039062 21.011719 42.039062 21 C 42.039062 20.5 42 20.019531 41.949219 19.550781 C 41.949219 19.519531 41.949219 19.488281 41.941406 19.460938 C 41.929688 19.339844 41.910156 19.230469 41.890625 19.121094 C 41.230469 15.019531 38.5 11.621094 34.800781 10.03125 C 33.25 9.421875 31.601562 9.121094 29.980469 9.121094 C 28.988281 9.121094 27.980469 9.230469 27 9.460938 C 25.929688 9.738281 24.929688 10.171875 24 10.71875 C 22.21875 9.671875 20.140625 9.058594 17.921875 9.058594 C 11.308594 9.058594 5.949219 14.421875 5.949219 21.03125 C 5.949219 27.640625 11.308594 33 17.921875 33 C 20.140625 33 22.21875 32.390625 24 31.339844 C 24.929688 31.890625 25.929688 32.308594 26.988281 32.601562 C 27.660156 32.75 28.339844 32.859375 29.019531 32.910156 C 29.339844 32.929688 29.660156 32.949219 29.980469 32.949219 C 30.390625 32.949219 30.800781 32.929688 31.210938 32.890625 C 31.851562 32.828125 32.5 32.71875 33.128906 32.570312 C 33.699219 32.429688 34.269531 32.25 34.820312 32.03125 C 38.570312 30.410156 41.320312 26.929688 41.921875 22.75 C 41.988281 22.21875 42.03125 21.660156 42.039062 21.078125 C 42.039062 21.070312 42.039062 21.058594 42.039062 21.039062 Z M 39.75 21.601562 C 39.75 21.660156 39.75 21.71875 39.738281 21.78125 C 39.738281 21.898438 39.71875 22.03125 39.710938 22.148438 C 39.710938 22.21875 39.691406 22.289062 39.679688 22.359375 C 39.671875 22.46875 39.648438 22.570312 39.640625 22.679688 C 39.628906 22.75 39.621094 22.828125 39.601562 22.898438 C 39.578125 23 39.558594 23.101562 39.539062 23.191406 C 39.519531 23.261719 39.511719 23.339844 39.488281 23.410156 C 39.46875 23.5 39.441406 23.601562 39.421875 23.691406 C 39.398438 23.761719 39.378906 23.828125 39.359375 23.898438 C 39.328125 24.019531 39.289062 24.140625 39.25 24.261719 C 39.210938 24.378906 39.171875 24.488281 39.128906 24.601562 C 39.109375 24.660156 39.089844 24.710938 39.070312 24.769531 C 39.03125 24.859375 39 24.960938 38.960938 25.050781 C 38.941406 25.101562 38.921875 25.148438 38.898438 25.191406 C 38.859375 25.289062 38.808594 25.378906 38.769531 25.46875 C 38.75 25.511719 38.730469 25.550781 38.710938 25.578125 C 38.660156 25.679688 38.609375 25.78125 38.558594 25.871094 C 38.550781 25.890625 38.539062 25.910156 38.53125 25.929688 C 38.441406 26.101562 38.339844 26.261719 38.230469 26.421875 C 38.199219 26.46875 38.160156 26.519531 38.128906 26.570312 C 38.058594 26.679688 37.980469 26.78125 37.910156 26.878906 C 37.871094 26.929688 37.828125 26.988281 37.789062 27.039062 C 37.710938 27.140625 37.628906 27.238281 37.550781 27.328125 C 37.511719 27.378906 37.46875 27.421875 37.429688 27.46875 C 37.421875 27.488281 37.398438 27.5 37.390625 27.519531 L 37.390625 16.96875 C 37.390625 16.351562 36.878906 15.839844 36.261719 15.839844 C 35.640625 15.839844 35.128906 16.351562 35.128906 16.96875 L 35.128906 28.910156 C 35.128906 29.039062 35.160156 29.171875 35.199219 29.289062 C 34.878906 29.46875 34.558594 29.640625 34.230469 29.78125 C 33.898438 29.929688 33.558594 30.050781 33.210938 30.160156 L 33.210938 20.199219 C 33.210938 19.578125 32.699219 19.070312 32.078125 19.070312 C 31.460938 19.070312 30.949219 19.578125 30.949219 20.199219 L 30.949219 30.609375 C 30.789062 30.621094 30.640625 30.640625 30.480469 30.640625 C 30.480469 30.640625 30.480469 30.640625 30.46875 30.640625 C 30.308594 30.640625 30.148438 30.648438 29.988281 30.648438 C 29.828125 30.648438 29.671875 30.648438 29.511719 30.640625 C 29.511719 30.640625 29.511719 30.640625 29.5 30.640625 C 29.339844 30.640625 29.191406 30.609375 29.03125 30.601562 L 29.03125 23.429688 C 29.03125 22.808594 28.519531 22.300781 27.898438 22.300781 C 27.28125 22.300781 26.769531 22.808594 26.769531 23.429688 L 26.769531 30.148438 C 26.609375 30.101562 26.449219 30.050781 26.289062 29.988281 C 26.289062 29.988281 26.28125 29.988281 26.269531 29.988281 C 26.171875 29.949219 26.070312 29.910156 25.980469 29.871094 C 25.921875 29.851562 25.871094 29.828125 25.808594 29.800781 C 25.808594 29.800781 25.789062 29.800781 25.789062 29.800781 C 25.46875 29.660156 25.160156 29.511719 24.859375 29.339844 L 24.859375 26.671875 C 24.859375 26.050781 24.351562 25.539062 23.730469 25.539062 C 23.109375 25.539062 22.601562 26.050781 22.601562 26.671875 L 22.601562 27.53125 C 22.171875 27.058594 21.789062 26.519531 21.460938 25.941406 C 21.449219 25.921875 21.441406 25.898438 21.429688 25.878906 C 21.378906 25.78125 21.328125 25.691406 21.28125 25.589844 C 21.261719 25.550781 21.238281 25.511719 21.21875 25.480469 C 21.179688 25.390625 21.128906 25.289062 21.089844 25.199219 C 21.070312 25.148438 21.050781 25.101562 21.03125 25.058594 C 20.988281 24.96875 20.949219 24.878906 20.921875 24.78125 C 20.898438 24.730469 20.878906 24.671875 20.859375 24.609375 C 20.820312 24.488281 20.769531 24.359375 20.730469 24.238281 C 20.691406 24.128906 20.660156 24.019531 20.628906 23.910156 C 20.609375 23.839844 20.589844 23.769531 20.570312 23.691406 C 20.550781 23.601562 20.519531 23.511719 20.5 23.410156 C 20.480469 23.339844 20.46875 23.261719 20.449219 23.191406 C 20.429688 23.089844 20.410156 23 20.390625 22.898438 C 20.378906 22.828125 20.359375 22.75 20.351562 22.679688 C 20.328125 22.578125 20.320312 22.46875 20.308594 22.359375 C 20.308594 22.289062 20.289062 22.21875 20.28125 22.140625 C 20.269531 22.019531 20.261719 21.898438 20.25 21.78125 C 20.25 21.71875 20.238281 21.660156 20.238281 21.601562 C 20.230469 21.410156 20.21875 21.21875 20.21875 21.03125 C 20.308594 16.328125 22.871094 13.449219 26 12.171875 C 27.289062 11.640625 28.671875 11.390625 30.019531 11.390625 C 34.660156 11.390625 39.699219 14.410156 39.820312 21.03125 C 39.820312 21.21875 39.808594 21.410156 39.800781 21.601562 Z M 39.75 21.601562 "/>
</g>
</svg>
