<svg width="343" height="161" viewBox="0 0 343 161" fill="none" xmlns="http://www.w3.org/2000/svg">
<line x1="160" y1="0.499939" x2="343" y2="0.499967" stroke="#FF5500"/>
<line x1="160.355" y1="0.563942" x2="1.35527" y2="159.564" stroke="#FF5500"/>
<path d="M1 100L1.00001 159.81" stroke="#FF5500" stroke-linecap="square"/>
<path d="M61.001 160L1.0006 160" stroke="#FF5500" stroke-linecap="square"/>
</svg>
