<svg width="24" height="24" viewBox="0 0 24 24" fill="none" xmlns="http://www.w3.org/2000/svg">
<path fill-rule="evenodd" clip-rule="evenodd" d="M12 24C18.6274 24 24 18.6274 24 12C24 5.37258 18.6274 0 12 0C5.37258 0 0 5.37258 0 12C0 18.6274 5.37258 24 12 24ZM17.9677 9.38437C17.9677 9.25313 17.9677 9.12186 17.9582 8.99061C18.5578 8.55934 19.0813 8.02499 19.5 7.42501C18.948 7.65936 18.3484 7.82815 17.7297 7.89374C18.3674 7.51877 18.8528 6.92814 19.0812 6.225C18.4911 6.57187 17.8249 6.82501 17.1301 6.95625C16.5685 6.36562 15.769 6 14.8839 6C13.1802 6 11.8096 7.35936 11.8096 9.02813C11.8096 9.26251 11.8382 9.49686 11.8858 9.72186C9.33503 9.59059 7.06026 8.39061 5.54693 6.55311C5.28041 7.00311 5.12816 7.51874 5.12816 8.08123C5.12816 9.13124 5.67065 10.0594 6.4987 10.6031C5.99429 10.5844 5.51836 10.4438 5.10911 10.2188V10.2562C5.10911 11.7281 6.16562 12.9469 7.57425 13.2281C7.31729 13.2937 7.04125 13.3312 6.76524 13.3312C6.56535 13.3312 6.37501 13.3125 6.18464 13.2844C6.57487 14.4844 7.70749 15.3563 9.05902 15.3844C8.00254 16.2 6.67955 16.6781 5.24239 16.6781C4.98539 16.6781 4.74747 16.6687 4.5 16.6406C5.86105 17.5031 7.47906 18 9.22083 18C14.8744 18 17.9677 13.3875 17.9677 9.38437Z" fill="#6BFBCE"/>
</svg>
