<svg width="96" height="96" viewBox="0 0 96 96" fill="none" xmlns="http://www.w3.org/2000/svg">
<circle cx="48" cy="48" r="48" fill="white"/>
<g clip-path="url(#clip0)">
<path d="M44.2637 71.2271L38.7182 69.618C38.1364 69.4544 37.8091 68.8453 37.9728 68.2635L50.3819 25.518C50.5455 24.9362 51.1546 24.6089 51.7364 24.7725L57.2819 26.3816C57.8637 26.5453 58.191 27.1544 58.0273 27.7362L45.6182 70.4816C45.4455 71.0635 44.8455 71.3998 44.2637 71.2271ZM33.9 61.0271L37.8546 56.8089C38.2728 56.3635 38.2455 55.6544 37.7819 55.2453L29.5455 47.9998L37.7819 40.7544C38.2455 40.3453 38.2819 39.6362 37.8546 39.1907L33.9 34.9725C33.491 34.5362 32.8 34.5089 32.3546 34.9271L19.2546 47.1998C18.791 47.6271 18.791 48.3635 19.2546 48.7907L32.3546 61.0725C32.8 61.4907 33.491 61.4725 33.9 61.0271ZM63.6455 61.0816L76.7455 48.7998C77.2091 48.3725 77.2091 47.6362 76.7455 47.2089L63.6455 34.918C63.2091 34.5089 62.5182 34.5271 62.1 34.9635L58.1455 39.1816C57.7273 39.6271 57.7546 40.3362 58.2182 40.7453L66.4546 47.9998L58.2182 55.2453C57.7546 55.6544 57.7182 56.3635 58.1455 56.8089L62.1 61.0271C62.5091 61.4725 63.2 61.4907 63.6455 61.0816Z" fill="#444444"/>
</g>
<defs>
<clipPath id="clip0">
<rect width="58.1818" height="46.5455" fill="white" transform="translate(18.9091 24.7271)"/>
</clipPath>
</defs>
</svg>
