<svg width="96" height="96" viewBox="0 0 96 96" fill="none" xmlns="http://www.w3.org/2000/svg">
<circle cx="48" cy="48" r="48" fill="white"/>
<g clip-path="url(#clip0)">
<path d="M73.0787 38.3837C72.585 37.9755 61.3351 28.9287 58.8619 26.9624C56.5385 25.1052 52.5659 21.0908 48 21.0908C43.4586 21.0908 39.5241 25.0554 37.1381 26.9624C34.5667 29.0068 23.3609 38.0198 22.932 38.3723C22.3564 38.8457 21.8927 39.4407 21.5744 40.1145C21.2561 40.7884 21.091 41.5244 21.0909 42.2696V69.8635C21.0909 72.6501 23.3498 74.909 26.1364 74.909H69.8637C72.6502 74.909 74.9091 72.6501 74.9091 69.8635V42.2722C74.9091 41.5292 74.745 40.7955 74.4286 40.1233C74.1122 39.4511 73.6512 38.8571 73.0787 38.3837ZM69.8637 69.2329C69.8637 69.4001 69.7972 69.5605 69.6789 69.6788C69.5607 69.7971 69.4003 69.8635 69.233 69.8635H26.7671C26.5998 69.8635 26.4394 69.7971 26.3211 69.6788C26.2028 69.5605 26.1364 69.4001 26.1364 69.2329V42.5705C26.1364 42.3799 26.2222 42.1998 26.3704 42.0801C28.0385 40.7332 37.806 32.877 40.2836 30.9073C42.193 29.3822 45.5191 26.1363 48 26.1363C50.4905 26.1363 53.8714 29.4336 55.7164 30.9073C58.1943 32.8772 67.9625 40.7347 69.6299 42.0825C69.703 42.1416 69.7619 42.2163 69.8023 42.3011C69.8428 42.3859 69.8637 42.4787 69.8637 42.5727V69.2329ZM66.501 49.5026C66.9476 50.0449 66.8652 50.8475 66.3176 51.2875C63.2719 53.7349 60.087 56.2906 58.8619 57.2646C56.476 59.1717 52.5415 63.1363 48 63.1363C43.4326 63.1363 39.4557 59.117 37.1381 57.2646C35.9525 56.3221 32.7503 53.7525 29.6827 51.2873C29.1351 50.8472 29.0528 50.0447 29.4993 49.5024L31.1031 47.5549C31.5423 47.0216 32.3284 46.9407 32.8668 47.3734C35.875 49.7912 39.0229 52.3175 40.2836 53.3198C42.1287 54.7935 45.5096 58.0908 48 58.0908C50.4809 58.0908 53.8071 54.8449 55.7164 53.3198C56.9772 52.3176 60.1253 49.7912 63.1336 47.3737C63.6719 46.9411 64.4581 47.022 64.8972 47.5553L66.501 49.5026Z" fill="#444444"/>
</g>
<defs>
<clipPath id="clip0">
<rect width="53.8182" height="53.8182" fill="white" transform="translate(21.0909 21.0908)"/>
</clipPath>
</defs>
</svg>
