module echoserver

go 1.21.5

require (
	github.com/grpc-ecosystem/grpc-gateway/v2 v2.18.1
	github.com/joho/godotenv v1.5.1
	google.golang.org/genproto/googleapis/api v0.0.0-20231106174013-bbf56f31fb17
	google.golang.org/grpc v1.60.0
	google.golang.org/grpc/cmd/protoc-gen-go-grpc v1.3.0
	google.golang.org/protobuf v1.31.0
)

require (
	github.com/golang/protobuf v1.5.3 // indirect
	github.com/kr/text v0.2.0 // indirect
	github.com/rogpeppe/go-internal v1.12.0 // indirect
	golang.org/x/net v0.17.0 // indirect
	golang.org/x/sys v0.13.0 // indirect
	golang.org/x/text v0.14.0 // indirect
	google.golang.org/genproto v0.0.0-20231030173426-d783a09b4405 // indirect
	google.golang.org/genproto/googleapis/rpc v0.0.0-20231030173426-d783a09b4405 // indirect
	gopkg.in/yaml.v3 v3.0.1 // indirect
)
