{
    "name": "Doggs",
    "description": "Good boy gone bad",
    "image": "https://coral-accused-wolverine-606.mypinata.cloud/ipfs/QmNvx6XBjjEee22uKfZgpN6SM41iZ63vu1hgDQkF6uokwN?_gl=1*ubn2le*_ga*NDM3MzI0ODczLjE2OTY0MDgyMTM.*_ga_5RMPXG14TE*MTY5NjQwODIxMy4xLjEuMTY5NjQwODU0NC42MC4wLjA."
}