<svg xmlns="http://www.w3.org/2000/svg" width="18" height="12" viewBox="0 0 18 12">
  <path id="ic_filter_list_24px" d="M10,18h4V16H10ZM3,6V8H21V6Zm3,7H18V11H6Z" transform="translate(-3 -6)" fill="#296838"/>
</svg>
