<svg xmlns="http://www.w3.org/2000/svg" width="680" height="410.452" viewBox="0 0 680 410.452">
  <defs>
    <style>
      .cls-1 {
        font-size: 10px;
      }

      .cls-1, .cls-2, .cls-3 {
        font-family: JosefinSans-Regular, Josefin Sans;
      }

      .cls-2 {
        font-size: 7px;
      }

      .cls-3 {
        font-size: 5px;
      }
    </style>
  </defs>
  <g id="Group_1640" data-name="Group 1640" transform="translate(-160 -143)">
    <text id="DOGTOBER._DESIGN" data-name="DOGTOBER.
DESIGN" class="cls-1" transform="translate(205.546 151)"><tspan x="0" y="0">DOGTOBER.</tspan><tspan x="0" y="11">DESIGN</tspan></text>
    <path id="Path_2475" data-name="Path 2475" d="M827.273,241.534a54.008,54.008,0,0,1,7.48-27.75,56.81,56.81,0,0,1,20.271-20.42,54.551,54.551,0,0,1,55.648,0,57.863,57.863,0,0,1,20.421,20.494,54.513,54.513,0,0,1,.074,55.5,56.234,56.234,0,0,1-20.419,20.2,54.4,54.4,0,0,1-27.826,7.48l.449-16.754a35.7,35.7,0,0,0,18.849-5.161,37.8,37.8,0,0,0,13.539-14.062,40.416,40.416,0,0,0-.076-39.119,38.455,38.455,0,0,0-13.762-14.211,37.224,37.224,0,0,0-38.073,0,38.03,38.03,0,0,0-13.613,14.211,39.519,39.519,0,0,0-5.011,19.6Z" transform="translate(-458.643 24.184)"/>
    <path id="Path_2476" data-name="Path 2476" d="M712.7,382.747a35.7,35.7,0,0,0-5.161-18.849,37.8,37.8,0,0,0-14.062-13.538,40.412,40.412,0,0,0-39.119.075A38.441,38.441,0,0,0,640.142,364.2a37.222,37.222,0,0,0,0,38.072,38.022,38.022,0,0,0,14.211,13.613,39.518,39.518,0,0,0,19.6,5.011v17.951a54.008,54.008,0,0,1-27.75-7.48,56.81,56.81,0,0,1-20.42-20.271,54.551,54.551,0,0,1,0-55.648,57.852,57.852,0,0,1,20.494-20.42,54.51,54.51,0,0,1,55.5-.075,56.234,56.234,0,0,1,20.2,20.419,54.381,54.381,0,0,1,7.479,27.4Z" transform="translate(-458.077 23.801)"/>
    <path id="Path_2477" data-name="Path 2477" d="M1299.725,241.75V258.5H1271.6v49.981h-17.354V258.5h-27.375V241.75Z" transform="translate(-459.725 24.033)"/>
    <g id="Group_1639" data-name="Group 1639" transform="translate(-458.077 24.36)">
      <text id="DESIGN_" data-name="DESIGN
//" class="cls-2" transform="translate(1025.768 326.441) rotate(90)"><tspan x="0" y="0">DESIGN</tspan><tspan x="0" y="8">//</tspan></text>
      <path id="Path_2478" data-name="Path 2478" d="M1109.329,327v16.754h-54.751v29.021h48.768V389.53h-48.768v29.62h25.306V435.9h-42.809V327Z" transform="translate(-1.134 -0.559)"/>
    </g>
    <g id="Group_1617" data-name="Group 1617" transform="translate(769.091 444.602)">
      <text id="DOGTO_BER." data-name="DOGTO
BER." class="cls-3" transform="translate(48.866 95.794)"><tspan x="0" y="0">DOGTO</tspan><tspan x="0" y="6">BER.</tspan></text>
      <path id="Path_2479" data-name="Path 2479" d="M1274.811,509l-10.984-16.945h-17.5V529.9h-17.5v-92.25l17.5.05v37.6h15.559q10.468,0,15.182-5.759a19.9,19.9,0,0,0,4.712-12.94,21.66,21.66,0,0,0-1.8-8.452,17.137,17.137,0,0,0-6.132-7.33q-4.343-3.064-11.37-3.067l-.217-16.7q16.324.661,26.471,9.22,11,9.278,11,25.73a41.356,41.356,0,0,1-4.263,18.624,29.185,29.185,0,0,1-13.388,13.239l13.316,21.142Z" transform="translate(-1228.822 -421.055)"/>
    </g>
    <path id="Path_2480" data-name="Path 2480" d="M653.83,137.6h-18.25V213.15h15.558a46.388,46.388,0,0,0,20.569-4.338,32.251,32.251,0,0,0,13.912-12.79q5.01-8.449,5.011-20.27a45.308,45.308,0,0,0-2.133-14.415l18.069-.312a62.578,62.578,0,0,1,2.016,15.924q0,15.858-7.4,27.9a50.29,50.29,0,0,1-19.821,18.55,57.446,57.446,0,0,1-27.076,6.507h-36.2V121h30.966q2.444,0,4.789.115Z" transform="translate(-458.077 24.359)"/>
    <path id="Path_2481" data-name="Path 2481" d="M1055.026,175.446a37.524,37.524,0,0,0,5.011,19.522,33.938,33.938,0,0,0,14.062,13.089,44.783,44.783,0,0,0,20.719,4.637,50.2,50.2,0,0,0,10.023-.972,28.881,28.881,0,0,0,8.078-2.767v-18.1h-20.494V174.1h38v44.729q-4.488,4.19-15.632,7.7a68.441,68.441,0,0,1-20.42,3.515q-17.2,0-30.218-6.881a49.292,49.292,0,0,1-20.046-18.924,53.112,53.112,0,0,1-7.031-27.3q0-.751.012-1.495Z" transform="translate(-459.211 24.216)"/>
    <g id="Group_1618" data-name="Group 1618" transform="translate(368.63 406.498)">
      <path id="Path_2482" data-name="Path 2482" d="M827.273,491.751v-108.9h29.769q17.054,0,26.479,6.956t9.423,20.42a28.472,28.472,0,0,1-3.665,14.735,26.994,26.994,0,0,1-10.4,9.948,34.128,34.128,0,0,1,14.287,10.322,24.028,24.028,0,0,1,5.16,15.259l-17.951.15q0-7.777-6.059-11.22t-15.034-3.441H844.775v45.776Zm17.5-62.53h15.11q7.478,0,11.294-4.338a15.93,15.93,0,0,0,3.814-10.92q0-7.18-4.562-10.771T857.79,399.6H844.775Z" transform="translate(-827.273 -382.847)"/>
      <rect id="Rectangle_315" data-name="Rectangle 315" width="17.494" height="11.801" transform="translate(15.209 97.103)"/>
    </g>
  </g>
</svg>
