[gd_scene load_steps=6 format=2]

[ext_resource path="res://assets/shaders/cel.shader" type="Shader" id=1]
[ext_resource path="res://assets/models/decorations/dining_table/dining_table.gltf" type="PackedScene" id=2]

[sub_resource type="ShaderMaterial" id=1]
shader = ExtResource( 1 )
shader_param/use_shadow = false
shader_param/base_color = Color( 0.4, 0.270588, 0.113725, 1 )
shader_param/use_specular = false
shader_param/specular_tint = Color( 0.75, 0.75, 0.75, 0.75 )

[sub_resource type="ShaderMaterial" id=2]
shader = ExtResource( 1 )
shader_param/use_shadow = false
shader_param/base_color = Color( 0.4, 0.270588, 0.113725, 1 )
shader_param/use_specular = false
shader_param/specular_tint = Color( 0.75, 0.75, 0.75, 0.75 )

[sub_resource type="BoxShape" id=3]
extents = Vector3( 0.588089, 0.32065, 1.054 )

[node name="dining_table" instance=ExtResource( 2 )]

[node name="Plane" parent="." index="0"]
material/0 = SubResource( 1 )

[node name="Plane001" parent="Plane" index="0"]
material/0 = SubResource( 2 )

[node name="StaticBody" type="StaticBody" parent="." index="1"]

[node name="CollisionShape" type="CollisionShape" parent="StaticBody" index="0"]
transform = Transform( 1, 0, 0, 0, 1, 0, 0, 0, 1, 0, 0.301312, 0 )
shape = SubResource( 3 )
