[gd_scene load_steps=5 format=2]

[ext_resource path="res://assets/shaders/cel.shader" type="Shader" id=1]
[ext_resource path="res://assets/models/decorations/fruit/apple/apple.gltf" type="PackedScene" id=2]

[sub_resource type="ShaderMaterial" id=1]
shader = ExtResource( 1 )
shader_param/use_shadow = false
shader_param/base_color = Color( 0.121569, 0.611765, 0, 1 )
shader_param/use_specular = false
shader_param/specular_tint = Color( 0.75, 0.75, 0.75, 0.75 )

[sub_resource type="ShaderMaterial" id=2]
shader = ExtResource( 1 )
shader_param/use_shadow = false
shader_param/base_color = Color( 0.552941, 0.345098, 0.0196078, 1 )
shader_param/use_specular = false
shader_param/specular_tint = Color( 0.75, 0.75, 0.75, 0.75 )

[node name="apple" instance=ExtResource( 2 )]

[node name="Fruit" parent="." index="0"]
material/0 = SubResource( 1 )

[node name="Stick" parent="." index="1"]
material/0 = SubResource( 2 )
