{
    "asset" : {
        "generator" : "Khronos glTF Blender I/O v1.3.48",
        "version" : "2.0"
    },
    "scene" : 0,
    "scenes" : [
        {
            "name" : "Scene",
            "nodes" : [
                0,
                1,
                2
            ]
        }
    ],
    "nodes" : [
        {
            "mesh" : 0,
            "name" : "Garbo-col"
        },
        {
            "mesh" : 1,
            "name" : "Wheels",
            "rotation" : [
                0,
                0,
                -0.7071068286895752,
                0.7071068286895752
            ],
            "translation" : [
                -0.29173025488853455,
                0.10000000149011612,
                -0.1967317909002304
            ]
        },
        {
            "mesh" : 2,
            "name" : "Lid",
            "translation" : [
                0,
                1.0080000162124634,
                0.003179505467414856
            ]
        }
    ],
    "materials" : [
        {
            "doubleSided" : true,
            "emissiveFactor" : [
                0,
                0,
                0
            ],
            "name" : "GreenPlastic",
            "pbrMetallicRoughness" : {
                "baseColorFactor" : [
                    0.07595740258693695,
                    0.17335110902786255,
                    0.0675477460026741,
                    1
                ],
                "metallicFactor" : 0,
                "roughnessFactor" : 0.8999999761581421
            }
        },
        {
            "doubleSided" : true,
            "emissiveFactor" : [
                0,
                0,
                0
            ],
            "name" : "BlackPlastic",
            "pbrMetallicRoughness" : {
                "baseColorFactor" : [
                    0,
                    0,
                    0,
                    1
                ],
                "metallicFactor" : 0,
                "roughnessFactor" : 1
            }
        },
        {
            "doubleSided" : true,
            "emissiveFactor" : [
                0,
                0,
                0
            ],
            "name" : "EyeGlow",
            "pbrMetallicRoughness" : {
                "baseColorFactor" : [
                    1,
                    0.9974825978279114,
                    0.14363038539886475,
                    1
                ],
                "metallicFactor" : 0,
                "roughnessFactor" : 0.5
            }
        },
        {
            "doubleSided" : true,
            "emissiveFactor" : [
                0,
                0,
                0
            ],
            "name" : "Metal",
            "pbrMetallicRoughness" : {
                "baseColorFactor" : [
                    0.570470929145813,
                    0.570470929145813,
                    0.570470929145813,
                    1
                ],
                "metallicFactor" : 1,
                "roughnessFactor" : 0.032808393239974976
            }
        },
        {
            "doubleSided" : true,
            "emissiveFactor" : [
                0,
                0,
                0
            ],
            "name" : "Rubber",
            "pbrMetallicRoughness" : {
                "baseColorFactor" : [
                    0.10247385501861572,
                    0.10247385501861572,
                    0.10247385501861572,
                    1
                ],
                "metallicFactor" : 0,
                "roughnessFactor" : 1
            }
        }
    ],
    "meshes" : [
        {
            "name" : "Plane",
            "primitives" : [
                {
                    "attributes" : {
                        "POSITION" : 0,
                        "NORMAL" : 1,
                        "TANGENT" : 2,
                        "TEXCOORD_0" : 3
                    },
                    "indices" : 4,
                    "material" : 0
                },
                {
                    "attributes" : {
                        "POSITION" : 5,
                        "NORMAL" : 6,
                        "TANGENT" : 7,
                        "TEXCOORD_0" : 8
                    },
                    "indices" : 9,
                    "material" : 1
                },
                {
                    "attributes" : {
                        "POSITION" : 10,
                        "NORMAL" : 11,
                        "TANGENT" : 12,
                        "TEXCOORD_0" : 13
                    },
                    "indices" : 14,
                    "material" : 2
                }
            ]
        },
        {
            "name" : "Cylinder",
            "primitives" : [
                {
                    "attributes" : {
                        "POSITION" : 15,
                        "NORMAL" : 16,
                        "TEXCOORD_0" : 17
                    },
                    "indices" : 18,
                    "material" : 3
                },
                {
                    "attributes" : {
                        "POSITION" : 19,
                        "NORMAL" : 20,
                        "TEXCOORD_0" : 21
                    },
                    "indices" : 22,
                    "material" : 4
                },
                {
                    "attributes" : {
                        "POSITION" : 23,
                        "NORMAL" : 24,
                        "TEXCOORD_0" : 25
                    },
                    "indices" : 26,
                    "material" : 1
                }
            ]
        },
        {
            "name" : "Plane.001",
            "primitives" : [
                {
                    "attributes" : {
                        "POSITION" : 27,
                        "NORMAL" : 28,
                        "TEXCOORD_0" : 29
                    },
                    "indices" : 30,
                    "material" : 0
                }
            ]
        }
    ],
    "accessors" : [
        {
            "bufferView" : 0,
            "componentType" : 5126,
            "count" : 1591,
            "max" : [
                0.29529663920402527,
                1.0080000162124634,
                0.3299306035041809
            ],
            "min" : [
                -0.29529663920402527,
                0,
                -0.3235737085342407
            ],
            "type" : "VEC3"
        },
        {
            "bufferView" : 1,
            "componentType" : 5126,
            "count" : 1591,
            "type" : "VEC3"
        },
        {
            "bufferView" : 2,
            "componentType" : 5126,
            "count" : 1591,
            "type" : "VEC4"
        },
        {
            "bufferView" : 3,
            "componentType" : 5126,
            "count" : 1591,
            "type" : "VEC2"
        },
        {
            "bufferView" : 4,
            "componentType" : 5123,
            "count" : 3900,
            "type" : "SCALAR"
        },
        {
            "bufferView" : 5,
            "componentType" : 5126,
            "count" : 189,
            "max" : [
                0.13817797601222992,
                0.7723442912101746,
                0.32128432393074036
            ],
            "min" : [
                -0.13817797601222992,
                0.7329171299934387,
                0.2955555319786072
            ],
            "type" : "VEC3"
        },
        {
            "bufferView" : 6,
            "componentType" : 5126,
            "count" : 189,
            "type" : "VEC3"
        },
        {
            "bufferView" : 7,
            "componentType" : 5126,
            "count" : 189,
            "type" : "VEC4"
        },
        {
            "bufferView" : 8,
            "componentType" : 5126,
            "count" : 189,
            "type" : "VEC2"
        },
        {
            "bufferView" : 9,
            "componentType" : 5123,
            "count" : 312,
            "type" : "SCALAR"
        },
        {
            "bufferView" : 10,
            "componentType" : 5126,
            "count" : 118,
            "max" : [
                0.13208253681659698,
                0.76792311668396,
                0.32119736075401306
            ],
            "min" : [
                -0.13208253681659698,
                0.5309258103370667,
                0.28617575764656067
            ],
            "type" : "VEC3"
        },
        {
            "bufferView" : 11,
            "componentType" : 5126,
            "count" : 118,
            "type" : "VEC3"
        },
        {
            "bufferView" : 12,
            "componentType" : 5126,
            "count" : 118,
            "type" : "VEC4"
        },
        {
            "bufferView" : 13,
            "componentType" : 5126,
            "count" : 118,
            "type" : "VEC2"
        },
        {
            "bufferView" : 14,
            "componentType" : 5123,
            "count" : 216,
            "type" : "SCALAR"
        },
        {
            "bufferView" : 15,
            "componentType" : 5126,
            "count" : 372,
            "max" : [
                0.01876777410507202,
                0.5673225522041321,
                0.01876778155565262
            ],
            "min" : [
                -0.018767783418297768,
                0.016137974336743355,
                -0.01876775175333023
            ],
            "type" : "VEC3"
        },
        {
            "bufferView" : 16,
            "componentType" : 5126,
            "count" : 372,
            "type" : "VEC3"
        },
        {
            "bufferView" : 17,
            "componentType" : 5126,
            "count" : 372,
            "type" : "VEC2"
        },
        {
            "bufferView" : 18,
            "componentType" : 5123,
            "count" : 1620,
            "type" : "SCALAR"
        },
        {
            "bufferView" : 19,
            "componentType" : 5126,
            "count" : 540,
            "max" : [
                0.10000000149011612,
                0.5662173628807068,
                0.10000000149011612
            ],
            "min" : [
                -0.10000003129243851,
                0.017243176698684692,
                -0.10000000149011612
            ],
            "type" : "VEC3"
        },
        {
            "bufferView" : 20,
            "componentType" : 5126,
            "count" : 540,
            "type" : "VEC3"
        },
        {
            "bufferView" : 21,
            "componentType" : 5126,
            "count" : 540,
            "type" : "VEC2"
        },
        {
            "bufferView" : 22,
            "componentType" : 5123,
            "count" : 2112,
            "type" : "SCALAR"
        },
        {
            "bufferView" : 23,
            "componentType" : 5126,
            "count" : 215,
            "max" : [
                0.08017107844352722,
                0.5600399374961853,
                0.08017107844352722
            ],
            "min" : [
                -0.08017110824584961,
                0.023420600220561028,
                -0.08017108589410782
            ],
            "type" : "VEC3"
        },
        {
            "bufferView" : 24,
            "componentType" : 5126,
            "count" : 215,
            "type" : "VEC3"
        },
        {
            "bufferView" : 25,
            "componentType" : 5126,
            "count" : 215,
            "type" : "VEC2"
        },
        {
            "bufferView" : 26,
            "componentType" : 5123,
            "count" : 768,
            "type" : "SCALAR"
        },
        {
            "bufferView" : 27,
            "componentType" : 5126,
            "count" : 1795,
            "max" : [
                0.26688969135284424,
                0.053163543343544006,
                0.29576918482780457
            ],
            "min" : [
                -0.26688969135284424,
                -0.00523708201944828,
                -0.3123639225959778
            ],
            "type" : "VEC3"
        },
        {
            "bufferView" : 28,
            "componentType" : 5126,
            "count" : 1795,
            "type" : "VEC3"
        },
        {
            "bufferView" : 29,
            "componentType" : 5126,
            "count" : 1795,
            "type" : "VEC2"
        },
        {
            "bufferView" : 30,
            "componentType" : 5123,
            "count" : 6996,
            "type" : "SCALAR"
        }
    ],
    "bufferViews" : [
        {
            "buffer" : 0,
            "byteLength" : 19092,
            "byteOffset" : 0
        },
        {
            "buffer" : 0,
            "byteLength" : 19092,
            "byteOffset" : 19092
        },
        {
            "buffer" : 0,
            "byteLength" : 25456,
            "byteOffset" : 38184
        },
        {
            "buffer" : 0,
            "byteLength" : 12728,
            "byteOffset" : 63640
        },
        {
            "buffer" : 0,
            "byteLength" : 7800,
            "byteOffset" : 76368
        },
        {
            "buffer" : 0,
            "byteLength" : 2268,
            "byteOffset" : 84168
        },
        {
            "buffer" : 0,
            "byteLength" : 2268,
            "byteOffset" : 86436
        },
        {
            "buffer" : 0,
            "byteLength" : 3024,
            "byteOffset" : 88704
        },
        {
            "buffer" : 0,
            "byteLength" : 1512,
            "byteOffset" : 91728
        },
        {
            "buffer" : 0,
            "byteLength" : 624,
            "byteOffset" : 93240
        },
        {
            "buffer" : 0,
            "byteLength" : 1416,
            "byteOffset" : 93864
        },
        {
            "buffer" : 0,
            "byteLength" : 1416,
            "byteOffset" : 95280
        },
        {
            "buffer" : 0,
            "byteLength" : 1888,
            "byteOffset" : 96696
        },
        {
            "buffer" : 0,
            "byteLength" : 944,
            "byteOffset" : 98584
        },
        {
            "buffer" : 0,
            "byteLength" : 432,
            "byteOffset" : 99528
        },
        {
            "buffer" : 0,
            "byteLength" : 4464,
            "byteOffset" : 99960
        },
        {
            "buffer" : 0,
            "byteLength" : 4464,
            "byteOffset" : 104424
        },
        {
            "buffer" : 0,
            "byteLength" : 2976,
            "byteOffset" : 108888
        },
        {
            "buffer" : 0,
            "byteLength" : 3240,
            "byteOffset" : 111864
        },
        {
            "buffer" : 0,
            "byteLength" : 6480,
            "byteOffset" : 115104
        },
        {
            "buffer" : 0,
            "byteLength" : 6480,
            "byteOffset" : 121584
        },
        {
            "buffer" : 0,
            "byteLength" : 4320,
            "byteOffset" : 128064
        },
        {
            "buffer" : 0,
            "byteLength" : 4224,
            "byteOffset" : 132384
        },
        {
            "buffer" : 0,
            "byteLength" : 2580,
            "byteOffset" : 136608
        },
        {
            "buffer" : 0,
            "byteLength" : 2580,
            "byteOffset" : 139188
        },
        {
            "buffer" : 0,
            "byteLength" : 1720,
            "byteOffset" : 141768
        },
        {
            "buffer" : 0,
            "byteLength" : 1536,
            "byteOffset" : 143488
        },
        {
            "buffer" : 0,
            "byteLength" : 21540,
            "byteOffset" : 145024
        },
        {
            "buffer" : 0,
            "byteLength" : 21540,
            "byteOffset" : 166564
        },
        {
            "buffer" : 0,
            "byteLength" : 14360,
            "byteOffset" : 188104
        },
        {
            "buffer" : 0,
            "byteLength" : 13992,
            "byteOffset" : 202464
        }
    ],
    "buffers" : [
        {
            "byteLength" : 216456,
            "uri" : "garbo.bin"
        }
    ]
}
