{
    "asset" : {
        "generator" : "Khronos glTF Blender I/O v1.3.48",
        "version" : "2.0"
    },
    "scene" : 0,
    "scenes" : [
        {
            "name" : "Scene",
            "nodes" : [
                0,
                1,
                2
            ]
        }
    ],
    "nodes" : [
        {
            "mesh" : 0,
            "name" : "Frame-col"
        },
        {
            "mesh" : 1,
            "name" : "Mattress",
            "translation" : [
                0,
                -0.016010744497179985,
                0
            ]
        },
        {
            "mesh" : 2,
            "name" : "Pillows",
            "rotation" : [
                0.32199826836586,
                0,
                0,
                0.9467402696609497
            ],
            "translation" : [
                0,
                0.4690638482570648,
                -0.8271162509918213
            ]
        }
    ],
    "materials" : [
        {
            "doubleSided" : true,
            "emissiveFactor" : [
                0,
                0,
                0
            ],
            "name" : "Frame",
            "pbrMetallicRoughness" : {
                "baseColorFactor" : [
                    0.31853896379470825,
                    0.14740397036075592,
                    0.05194929987192154,
                    1
                ],
                "metallicFactor" : 0,
                "roughnessFactor" : 0.9528796076774597
            }
        },
        {
            "doubleSided" : true,
            "emissiveFactor" : [
                0,
                0,
                0
            ],
            "name" : "Blanket",
            "pbrMetallicRoughness" : {
                "baseColorFactor" : [
                    0.023577122017741203,
                    0.12336666882038116,
                    0.2267257124185562,
                    1
                ],
                "metallicFactor" : 0,
                "roughnessFactor" : 1
            }
        },
        {
            "doubleSided" : true,
            "emissiveFactor" : [
                0,
                0,
                0
            ],
            "name" : "Mattress",
            "pbrMetallicRoughness" : {
                "baseColorFactor" : [
                    1,
                    1,
                    1,
                    1
                ],
                "metallicFactor" : 0,
                "roughnessFactor" : 0.9287958145141602
            }
        },
        {
            "doubleSided" : true,
            "emissiveFactor" : [
                0,
                0,
                0
            ],
            "name" : "Pillow",
            "pbrMetallicRoughness" : {
                "baseColorFactor" : [
                    0.6007895469665527,
                    0.4904060959815979,
                    0.9258264303207397,
                    1
                ],
                "metallicFactor" : 0,
                "roughnessFactor" : 0.5
            }
        }
    ],
    "meshes" : [
        {
            "name" : "Plane",
            "primitives" : [
                {
                    "attributes" : {
                        "POSITION" : 0,
                        "NORMAL" : 1,
                        "TEXCOORD_0" : 2
                    },
                    "indices" : 3,
                    "material" : 0
                }
            ]
        },
        {
            "name" : "Plane.001",
            "primitives" : [
                {
                    "attributes" : {
                        "POSITION" : 4,
                        "NORMAL" : 5,
                        "TANGENT" : 6,
                        "TEXCOORD_0" : 7
                    },
                    "indices" : 8,
                    "material" : 1
                },
                {
                    "attributes" : {
                        "POSITION" : 9,
                        "NORMAL" : 10,
                        "TANGENT" : 11,
                        "TEXCOORD_0" : 12
                    },
                    "indices" : 13,
                    "material" : 2
                }
            ]
        },
        {
            "name" : "Plane.003",
            "primitives" : [
                {
                    "attributes" : {
                        "POSITION" : 14,
                        "NORMAL" : 15,
                        "TANGENT" : 16,
                        "TEXCOORD_0" : 17
                    },
                    "indices" : 18,
                    "material" : 3
                }
            ]
        }
    ],
    "accessors" : [
        {
            "bufferView" : 0,
            "componentType" : 5126,
            "count" : 1575,
            "max" : [
                0.7799999713897705,
                0.6499999761581421,
                1.034999966621399
            ],
            "min" : [
                -0.7799999713897705,
                0,
                -1.034999966621399
            ],
            "type" : "VEC3"
        },
        {
            "bufferView" : 1,
            "componentType" : 5126,
            "count" : 1575,
            "type" : "VEC3"
        },
        {
            "bufferView" : 2,
            "componentType" : 5126,
            "count" : 1575,
            "type" : "VEC2"
        },
        {
            "bufferView" : 3,
            "componentType" : 5123,
            "count" : 6690,
            "type" : "SCALAR"
        },
        {
            "bufferView" : 4,
            "componentType" : 5126,
            "count" : 132,
            "max" : [
                0.771815299987793,
                0.36228305101394653,
                1.0317773818969727
            ],
            "min" : [
                -0.771815299987793,
                0.2901363968849182,
                -0.6334021687507629
            ],
            "type" : "VEC3"
        },
        {
            "bufferView" : 5,
            "componentType" : 5126,
            "count" : 132,
            "type" : "VEC3"
        },
        {
            "bufferView" : 6,
            "componentType" : 5126,
            "count" : 132,
            "type" : "VEC4"
        },
        {
            "bufferView" : 7,
            "componentType" : 5126,
            "count" : 132,
            "type" : "VEC2"
        },
        {
            "bufferView" : 8,
            "componentType" : 5123,
            "count" : 744,
            "type" : "SCALAR"
        },
        {
            "bufferView" : 9,
            "componentType" : 5126,
            "count" : 106,
            "max" : [
                0.7627118825912476,
                0.3537611961364746,
                -0.6327889561653137
            ],
            "min" : [
                -0.7627118825912476,
                0.2977220416069031,
                -1.0099999904632568
            ],
            "type" : "VEC3"
        },
        {
            "bufferView" : 10,
            "componentType" : 5126,
            "count" : 106,
            "type" : "VEC3"
        },
        {
            "bufferView" : 11,
            "componentType" : 5126,
            "count" : 106,
            "type" : "VEC4"
        },
        {
            "bufferView" : 12,
            "componentType" : 5126,
            "count" : 106,
            "type" : "VEC2"
        },
        {
            "bufferView" : 13,
            "componentType" : 5123,
            "count" : 588,
            "type" : "SCALAR"
        },
        {
            "bufferView" : 14,
            "componentType" : 5126,
            "count" : 1396,
            "max" : [
                0.6793370842933655,
                0.09329351782798767,
                0.24731901288032532
            ],
            "min" : [
                -0.6793370842933655,
                -0.07757258415222168,
                -0.2454904317855835
            ],
            "type" : "VEC3"
        },
        {
            "bufferView" : 15,
            "componentType" : 5126,
            "count" : 1396,
            "type" : "VEC3"
        },
        {
            "bufferView" : 16,
            "componentType" : 5126,
            "count" : 1396,
            "type" : "VEC4"
        },
        {
            "bufferView" : 17,
            "componentType" : 5126,
            "count" : 1396,
            "type" : "VEC2"
        },
        {
            "bufferView" : 18,
            "componentType" : 5123,
            "count" : 6144,
            "type" : "SCALAR"
        }
    ],
    "bufferViews" : [
        {
            "buffer" : 0,
            "byteLength" : 18900,
            "byteOffset" : 0
        },
        {
            "buffer" : 0,
            "byteLength" : 18900,
            "byteOffset" : 18900
        },
        {
            "buffer" : 0,
            "byteLength" : 12600,
            "byteOffset" : 37800
        },
        {
            "buffer" : 0,
            "byteLength" : 13380,
            "byteOffset" : 50400
        },
        {
            "buffer" : 0,
            "byteLength" : 1584,
            "byteOffset" : 63780
        },
        {
            "buffer" : 0,
            "byteLength" : 1584,
            "byteOffset" : 65364
        },
        {
            "buffer" : 0,
            "byteLength" : 2112,
            "byteOffset" : 66948
        },
        {
            "buffer" : 0,
            "byteLength" : 1056,
            "byteOffset" : 69060
        },
        {
            "buffer" : 0,
            "byteLength" : 1488,
            "byteOffset" : 70116
        },
        {
            "buffer" : 0,
            "byteLength" : 1272,
            "byteOffset" : 71604
        },
        {
            "buffer" : 0,
            "byteLength" : 1272,
            "byteOffset" : 72876
        },
        {
            "buffer" : 0,
            "byteLength" : 1696,
            "byteOffset" : 74148
        },
        {
            "buffer" : 0,
            "byteLength" : 848,
            "byteOffset" : 75844
        },
        {
            "buffer" : 0,
            "byteLength" : 1176,
            "byteOffset" : 76692
        },
        {
            "buffer" : 0,
            "byteLength" : 16752,
            "byteOffset" : 77868
        },
        {
            "buffer" : 0,
            "byteLength" : 16752,
            "byteOffset" : 94620
        },
        {
            "buffer" : 0,
            "byteLength" : 22336,
            "byteOffset" : 111372
        },
        {
            "buffer" : 0,
            "byteLength" : 11168,
            "byteOffset" : 133708
        },
        {
            "buffer" : 0,
            "byteLength" : 12288,
            "byteOffset" : 144876
        }
    ],
    "buffers" : [
        {
            "byteLength" : 157164,
            "uri" : "bed.bin"
        }
    ]
}
