{
    "asset" : {
        "generator" : "Khronos glTF Blender I/O v1.3.48",
        "version" : "2.0"
    },
    "scene" : 0,
    "scenes" : [
        {
            "name" : "Scene",
            "nodes" : [
                0
            ]
        }
    ],
    "nodes" : [
        {
            "mesh" : 0,
            "name" : "Circle"
        }
    ],
    "materials" : [
        {
            "doubleSided" : true,
            "emissiveFactor" : [
                0,
                0,
                0
            ],
            "name" : "Red",
            "pbrMetallicRoughness" : {
                "baseColorFactor" : [
                    0.8000000715255737,
                    0.07765281200408936,
                    0.05126991122961044,
                    1
                ],
                "metallicFactor" : 0,
                "roughnessFactor" : 1
            }
        },
        {
            "doubleSided" : true,
            "emissiveFactor" : [
                0,
                0,
                0
            ],
            "name" : "Metal",
            "pbrMetallicRoughness" : {
                "baseColorFactor" : [
                    0.5173337459564209,
                    0.5173337459564209,
                    0.5173337459564209,
                    1
                ],
                "metallicFactor" : 1,
                "roughnessFactor" : 0.2481481432914734
            }
        },
        {
            "doubleSided" : true,
            "emissiveFactor" : [
                0,
                0,
                0
            ],
            "name" : "Blue",
            "pbrMetallicRoughness" : {
                "baseColorFactor" : [
                    0.05503404885530472,
                    0.018803056329488754,
                    0.4019691050052643,
                    1
                ],
                "metallicFactor" : 0,
                "roughnessFactor" : 0.33703702688217163
            }
        }
    ],
    "meshes" : [
        {
            "name" : "Circle",
            "primitives" : [
                {
                    "attributes" : {
                        "POSITION" : 0,
                        "NORMAL" : 1,
                        "TANGENT" : 2,
                        "TEXCOORD_0" : 3
                    },
                    "indices" : 4,
                    "material" : 0
                },
                {
                    "attributes" : {
                        "POSITION" : 5,
                        "NORMAL" : 6,
                        "TANGENT" : 7,
                        "TEXCOORD_0" : 8
                    },
                    "indices" : 9,
                    "material" : 1
                },
                {
                    "attributes" : {
                        "POSITION" : 10,
                        "NORMAL" : 11,
                        "TANGENT" : 12,
                        "TEXCOORD_0" : 13
                    },
                    "indices" : 14,
                    "material" : 2
                }
            ]
        }
    ],
    "accessors" : [
        {
            "bufferView" : 0,
            "componentType" : 5126,
            "count" : 205,
            "max" : [
                0.014606278389692307,
                0.20400002598762512,
                0.014606278389692307
            ],
            "min" : [
                -0.014606280252337456,
                0.17807599902153015,
                -0.014606278389692307
            ],
            "type" : "VEC3"
        },
        {
            "bufferView" : 1,
            "componentType" : 5126,
            "count" : 205,
            "type" : "VEC3"
        },
        {
            "bufferView" : 2,
            "componentType" : 5126,
            "count" : 205,
            "type" : "VEC4"
        },
        {
            "bufferView" : 3,
            "componentType" : 5126,
            "count" : 205,
            "type" : "VEC2"
        },
        {
            "bufferView" : 4,
            "componentType" : 5123,
            "count" : 768,
            "type" : "SCALAR"
        },
        {
            "bufferView" : 5,
            "componentType" : 5126,
            "count" : 441,
            "max" : [
                0.032999999821186066,
                0.17807599902153015,
                0.032999999821186066
            ],
            "min" : [
                -0.032999999821186066,
                0,
                -0.032999999821186066
            ],
            "type" : "VEC3"
        },
        {
            "bufferView" : 6,
            "componentType" : 5126,
            "count" : 441,
            "type" : "VEC3"
        },
        {
            "bufferView" : 7,
            "componentType" : 5126,
            "count" : 441,
            "type" : "VEC4"
        },
        {
            "bufferView" : 8,
            "componentType" : 5126,
            "count" : 441,
            "type" : "VEC2"
        },
        {
            "bufferView" : 9,
            "componentType" : 5123,
            "count" : 2112,
            "type" : "SCALAR"
        },
        {
            "bufferView" : 10,
            "componentType" : 5126,
            "count" : 96,
            "max" : [
                0.032999999821186066,
                0.16080541908740997,
                0.032999999821186066
            ],
            "min" : [
                -0.032999999821186066,
                0.002827417105436325,
                -0.032999999821186066
            ],
            "type" : "VEC3"
        },
        {
            "bufferView" : 11,
            "componentType" : 5126,
            "count" : 96,
            "type" : "VEC3"
        },
        {
            "bufferView" : 12,
            "componentType" : 5126,
            "count" : 96,
            "type" : "VEC4"
        },
        {
            "bufferView" : 13,
            "componentType" : 5126,
            "count" : 96,
            "type" : "VEC2"
        },
        {
            "bufferView" : 14,
            "componentType" : 5123,
            "count" : 480,
            "type" : "SCALAR"
        }
    ],
    "bufferViews" : [
        {
            "buffer" : 0,
            "byteLength" : 2460,
            "byteOffset" : 0
        },
        {
            "buffer" : 0,
            "byteLength" : 2460,
            "byteOffset" : 2460
        },
        {
            "buffer" : 0,
            "byteLength" : 3280,
            "byteOffset" : 4920
        },
        {
            "buffer" : 0,
            "byteLength" : 1640,
            "byteOffset" : 8200
        },
        {
            "buffer" : 0,
            "byteLength" : 1536,
            "byteOffset" : 9840
        },
        {
            "buffer" : 0,
            "byteLength" : 5292,
            "byteOffset" : 11376
        },
        {
            "buffer" : 0,
            "byteLength" : 5292,
            "byteOffset" : 16668
        },
        {
            "buffer" : 0,
            "byteLength" : 7056,
            "byteOffset" : 21960
        },
        {
            "buffer" : 0,
            "byteLength" : 3528,
            "byteOffset" : 29016
        },
        {
            "buffer" : 0,
            "byteLength" : 4224,
            "byteOffset" : 32544
        },
        {
            "buffer" : 0,
            "byteLength" : 1152,
            "byteOffset" : 36768
        },
        {
            "buffer" : 0,
            "byteLength" : 1152,
            "byteOffset" : 37920
        },
        {
            "buffer" : 0,
            "byteLength" : 1536,
            "byteOffset" : 39072
        },
        {
            "buffer" : 0,
            "byteLength" : 768,
            "byteOffset" : 40608
        },
        {
            "buffer" : 0,
            "byteLength" : 960,
            "byteOffset" : 41376
        }
    ],
    "buffers" : [
        {
            "byteLength" : 42336,
            "uri" : "wd_40.bin"
        }
    ]
}
