; Engine configuration file.
; It's best edited using the editor UI and not directly,
; since the parameters that go here are not all obvious.
;
; Format:
;   [section] ; section goes between []
;   param=value ; assign values to parameters

config_version=4

_global_script_classes=[ {
"base": "Useable",
"class": "Case",
"language": "GDScript",
"path": "res://classes/useables/case.gd"
}, {
"base": "Camera",
"class": "CinematicCamera",
"language": "GDScript",
"path": "res://classes/cinematic_camera.gd"
}, {
"base": "Node",
"class": "DialogueManager",
"language": "GDScript",
"path": "res://managers/dialogue_manager.gd"
}, {
"base": "RichTextLabel",
"class": "FadingText",
"language": "GDScript",
"path": "res://classes/fading_text/fading_text.gd"
}, {
"base": "Useable",
"class": "ItemPickup",
"language": "GDScript",
"path": "res://classes/useables/item_pickup.gd"
}, {
"base": "KinematicBody",
"class": "Player",
"language": "GDScript",
"path": "res://entities/player/player.gd"
}, {
"base": "Control",
"class": "Puzzle",
"language": "GDScript",
"path": "res://classes/puzzles/puzzle.gd"
}, {
"base": "Tween",
"class": "RangeTween",
"language": "GDScript",
"path": "res://classes/tweens/range_tween.gd"
}, {
"base": "Useable",
"class": "Speaker",
"language": "GDScript",
"path": "res://classes/useables/speaker.gd"
}, {
"base": "Node",
"class": "State",
"language": "GDScript",
"path": "res://classes/state/state.gd"
}, {
"base": "Node",
"class": "StateMachine",
"language": "GDScript",
"path": "res://classes/state/state_machine.gd"
}, {
"base": "Control",
"class": "SuspicionBar",
"language": "GDScript",
"path": "res://ui/suspicion_bar/suspicion_bar.gd"
}, {
"base": "ColorRect",
"class": "SuspicionBarSegment",
"language": "GDScript",
"path": "res://ui/suspicion_bar/suspicion_bar_segment.gd"
}, {
"base": "Node",
"class": "Task",
"language": "GDScript",
"path": "res://managers/task.gd"
}, {
"base": "Node",
"class": "TaskManager",
"language": "GDScript",
"path": "res://managers/task_manager.gd"
}, {
"base": "MeshInstance",
"class": "TextPlane",
"language": "GDScript",
"path": "res://classes/text_plane/text_plane.gd"
}, {
"base": "Control",
"class": "UI",
"language": "GDScript",
"path": "res://ui/ui.gd"
}, {
"base": "Area",
"class": "Useable",
"language": "GDScript",
"path": "res://classes/useables/useable.gd"
}, {
"base": "Node",
"class": "Yarn",
"language": "GDScript",
"path": "res://addons/yarn_loader/yarn.gd"
}, {
"base": "Node",
"class": "YarnPlayer",
"language": "GDScript",
"path": "res://addons/yarn_loader/yarn_player.gd"
} ]
_global_script_class_icons={
"Case": "",
"CinematicCamera": "",
"DialogueManager": "",
"FadingText": "",
"ItemPickup": "",
"Player": "",
"Puzzle": "",
"RangeTween": "",
"Speaker": "",
"State": "",
"StateMachine": "",
"SuspicionBar": "",
"SuspicionBarSegment": "",
"Task": "",
"TaskManager": "",
"TextPlane": "",
"UI": "",
"Useable": "",
"Yarn": "",
"YarnPlayer": "res://addons/yarn_loader/yarn_player.png"
}

[application]

config/name="Loose Units"
run/main_scene="res://ui/splashes/intro.tscn"
config/icon="res://config/icon.png"

[autoload]

_YarnStore="*res://addons/yarn_loader/yarn_store.gd"
Inventory="*res://singletons/inventory.gd"
Stats="*res://singletons/stats.gd"

[display]

window/size/width=1600
window/size/height=1000
window/size/fullscreen=true
window/size/test_width=1280
window/size/test_height=720
window/dpi/allow_hidpi=true
window/stretch/mode="2d"
window/stretch/aspect="keep_height"

[editor_plugins]

enabled=PoolStringArray( "yarn_loader" )

[input]

move_left={
"deadzone": 0.5,
"events": [ Object(InputEventKey,"resource_local_to_scene":false,"resource_name":"","device":0,"alt":false,"shift":false,"control":false,"meta":false,"command":false,"pressed":false,"scancode":65,"unicode":0,"echo":false,"script":null)
, Object(InputEventJoypadMotion,"resource_local_to_scene":false,"resource_name":"","device":0,"axis":0,"axis_value":-1.0,"script":null)
 ]
}
move_right={
"deadzone": 0.5,
"events": [ Object(InputEventKey,"resource_local_to_scene":false,"resource_name":"","device":0,"alt":false,"shift":false,"control":false,"meta":false,"command":false,"pressed":false,"scancode":68,"unicode":0,"echo":false,"script":null)
, Object(InputEventJoypadMotion,"resource_local_to_scene":false,"resource_name":"","device":0,"axis":0,"axis_value":1.0,"script":null)
 ]
}
move_up={
"deadzone": 0.5,
"events": [ Object(InputEventKey,"resource_local_to_scene":false,"resource_name":"","device":0,"alt":false,"shift":false,"control":false,"meta":false,"command":false,"pressed":false,"scancode":87,"unicode":0,"echo":false,"script":null)
, Object(InputEventJoypadMotion,"resource_local_to_scene":false,"resource_name":"","device":0,"axis":1,"axis_value":-1.0,"script":null)
 ]
}
move_down={
"deadzone": 0.5,
"events": [ Object(InputEventKey,"resource_local_to_scene":false,"resource_name":"","device":0,"alt":false,"shift":false,"control":false,"meta":false,"command":false,"pressed":false,"scancode":83,"unicode":0,"echo":false,"script":null)
, Object(InputEventJoypadMotion,"resource_local_to_scene":false,"resource_name":"","device":0,"axis":1,"axis_value":1.0,"script":null)
 ]
}
click={
"deadzone": 0.5,
"events": [ Object(InputEventMouseButton,"resource_local_to_scene":false,"resource_name":"","device":0,"alt":false,"shift":false,"control":false,"meta":false,"command":false,"button_mask":0,"position":Vector2( 0, 0 ),"global_position":Vector2( 0, 0 ),"factor":1.0,"button_index":1,"pressed":false,"doubleclick":false,"script":null)
, Object(InputEventJoypadButton,"resource_local_to_scene":false,"resource_name":"","device":0,"button_index":0,"pressure":0.0,"pressed":false,"script":null)
 ]
}
view_left={
"deadzone": 0.5,
"events": [ Object(InputEventJoypadMotion,"resource_local_to_scene":false,"resource_name":"","device":0,"axis":2,"axis_value":-1.0,"script":null)
 ]
}
view_right={
"deadzone": 0.5,
"events": [ Object(InputEventJoypadMotion,"resource_local_to_scene":false,"resource_name":"","device":0,"axis":2,"axis_value":1.0,"script":null)
 ]
}
view_up={
"deadzone": 0.5,
"events": [ Object(InputEventJoypadMotion,"resource_local_to_scene":false,"resource_name":"","device":0,"axis":3,"axis_value":-1.0,"script":null)
 ]
}
view_down={
"deadzone": 0.5,
"events": [ Object(InputEventJoypadMotion,"resource_local_to_scene":false,"resource_name":"","device":0,"axis":3,"axis_value":1.0,"script":null)
 ]
}

[rendering]

quality/driver/driver_name="GLES2"
vram_compression/import_etc=true
vram_compression/import_etc2=false
quality/filters/msaa=1
environment/default_environment="res://config/default_env.tres"
