[gd_scene load_steps=6 format=2]

[ext_resource path="res://assets/models/characters/roomba/roomba.gltf" type="PackedScene" id=1]
[ext_resource path="res://assets/shaders/cel.shader" type="Shader" id=2]

[sub_resource type="ShaderMaterial" id=1]
shader = ExtResource( 2 )
shader_param/use_shadow = false
shader_param/base_color = Color( 0.12549, 0.12549, 0.12549, 1 )
shader_param/use_specular = false
shader_param/specular_tint = Color( 0.75, 0.75, 0.75, 0.75 )

[sub_resource type="ShaderMaterial" id=2]
shader = ExtResource( 2 )
shader_param/use_shadow = false
shader_param/base_color = Color( 0.266667, 0.760784, 0.713726, 1 )
shader_param/use_specular = false
shader_param/specular_tint = Color( 0.75, 0.75, 0.75, 0.75 )

[sub_resource type="ShaderMaterial" id=3]
shader = ExtResource( 2 )
shader_param/use_shadow = false
shader_param/base_color = Color( 0.784314, 0, 0, 1 )
shader_param/use_specular = false
shader_param/specular_tint = Color( 0.74902, 0.74902, 0.74902, 0.74902 )

[node name="Roomba" instance=ExtResource( 1 )]

[node name="Body" parent="." index="0"]
material/0 = SubResource( 1 )
material/1 = SubResource( 2 )

[node name="Eye" parent="." index="1"]
material/0 = SubResource( 1 )
material/1 = SubResource( 3 )
