{
    "asset" : {
        "generator" : "Khronos glTF Blender I/O v1.3.48",
        "version" : "2.0"
    },
    "scene" : 0,
    "scenes" : [
        {
            "name" : "Scene",
            "nodes" : [
                0
            ]
        }
    ],
    "nodes" : [
        {
            "mesh" : 0,
            "name" : "Plane"
        }
    ],
    "materials" : [
        {
            "doubleSided" : true,
            "emissiveFactor" : [
                0,
                0,
                0
            ],
            "name" : "Wood",
            "pbrMetallicRoughness" : {
                "baseColorFactor" : [
                    0.22025613486766815,
                    0.08084068447351456,
                    0.01893184520304203,
                    1
                ],
                "metallicFactor" : 0,
                "roughnessFactor" : 0.5
            }
        },
        {
            "doubleSided" : true,
            "emissiveFactor" : [
                0,
                0,
                0
            ],
            "name" : "Void",
            "pbrMetallicRoughness" : {
                "baseColorFactor" : [
                    0,
                    0,
                    0,
                    1
                ],
                "metallicFactor" : 0,
                "roughnessFactor" : 0.5
            }
        },
        {
            "doubleSided" : true,
            "emissiveFactor" : [
                0,
                0,
                0
            ],
            "name" : "Fabric",
            "pbrMetallicRoughness" : {
                "baseColorFactor" : [
                    1,
                    1,
                    1,
                    1
                ],
                "metallicFactor" : 0,
                "roughnessFactor" : 0.5
            }
        }
    ],
    "meshes" : [
        {
            "name" : "Plane",
            "primitives" : [
                {
                    "attributes" : {
                        "POSITION" : 0,
                        "NORMAL" : 1,
                        "TEXCOORD_0" : 2
                    },
                    "indices" : 3,
                    "material" : 0
                },
                {
                    "attributes" : {
                        "POSITION" : 4,
                        "NORMAL" : 5,
                        "TEXCOORD_0" : 6
                    },
                    "indices" : 7,
                    "material" : 1
                },
                {
                    "attributes" : {
                        "POSITION" : 8,
                        "NORMAL" : 9,
                        "TEXCOORD_0" : 10
                    },
                    "indices" : 11,
                    "material" : 2
                }
            ]
        }
    ],
    "accessors" : [
        {
            "bufferView" : 0,
            "componentType" : 5126,
            "count" : 1720,
            "max" : [
                0.19999998807907104,
                0.47999998927116394,
                0.17509658634662628
            ],
            "min" : [
                -0.19999998807907104,
                -3.725290298461914e-09,
                -0.17500001192092896
            ],
            "type" : "VEC3"
        },
        {
            "bufferView" : 1,
            "componentType" : 5126,
            "count" : 1720,
            "type" : "VEC3"
        },
        {
            "bufferView" : 2,
            "componentType" : 5126,
            "count" : 1720,
            "type" : "VEC2"
        },
        {
            "bufferView" : 3,
            "componentType" : 5123,
            "count" : 6348,
            "type" : "SCALAR"
        },
        {
            "bufferView" : 4,
            "componentType" : 5126,
            "count" : 285,
            "max" : [
                0.17999999225139618,
                0.30666667222976685,
                0.18284009397029877
            ],
            "min" : [
                -0.17999999225139618,
                0.1733333319425583,
                0.17500001192092896
            ],
            "type" : "VEC3"
        },
        {
            "bufferView" : 5,
            "componentType" : 5126,
            "count" : 285,
            "type" : "VEC3"
        },
        {
            "bufferView" : 6,
            "componentType" : 5126,
            "count" : 285,
            "type" : "VEC2"
        },
        {
            "bufferView" : 7,
            "componentType" : 5123,
            "count" : 792,
            "type" : "SCALAR"
        },
        {
            "bufferView" : 8,
            "componentType" : 5126,
            "count" : 37,
            "max" : [
                0.17499999701976776,
                0.30240097641944885,
                0.1754092425107956
            ],
            "min" : [
                -0.17499999701976776,
                0.1783333271741867,
                0.17500001192092896
            ],
            "type" : "VEC3"
        },
        {
            "bufferView" : 9,
            "componentType" : 5126,
            "count" : 37,
            "type" : "VEC3"
        },
        {
            "bufferView" : 10,
            "componentType" : 5126,
            "count" : 37,
            "type" : "VEC2"
        },
        {
            "bufferView" : 11,
            "componentType" : 5123,
            "count" : 102,
            "type" : "SCALAR"
        }
    ],
    "bufferViews" : [
        {
            "buffer" : 0,
            "byteLength" : 20640,
            "byteOffset" : 0
        },
        {
            "buffer" : 0,
            "byteLength" : 20640,
            "byteOffset" : 20640
        },
        {
            "buffer" : 0,
            "byteLength" : 13760,
            "byteOffset" : 41280
        },
        {
            "buffer" : 0,
            "byteLength" : 12696,
            "byteOffset" : 55040
        },
        {
            "buffer" : 0,
            "byteLength" : 3420,
            "byteOffset" : 67736
        },
        {
            "buffer" : 0,
            "byteLength" : 3420,
            "byteOffset" : 71156
        },
        {
            "buffer" : 0,
            "byteLength" : 2280,
            "byteOffset" : 74576
        },
        {
            "buffer" : 0,
            "byteLength" : 1584,
            "byteOffset" : 76856
        },
        {
            "buffer" : 0,
            "byteLength" : 444,
            "byteOffset" : 78440
        },
        {
            "buffer" : 0,
            "byteLength" : 444,
            "byteOffset" : 78884
        },
        {
            "buffer" : 0,
            "byteLength" : 296,
            "byteOffset" : 79328
        },
        {
            "buffer" : 0,
            "byteLength" : 204,
            "byteOffset" : 79624
        }
    ],
    "buffers" : [
        {
            "byteLength" : 79828,
            "uri" : "bedside_table.bin"
        }
    ]
}
