{
    "asset" : {
        "generator" : "Khronos glTF Blender I/O v1.3.48",
        "version" : "2.0"
    },
    "scene" : 0,
    "scenes" : [
        {
            "name" : "Scene",
            "nodes" : [
                0,
                1,
                2
            ]
        }
    ],
    "nodes" : [
        {
            "name" : "Light",
            "rotation" : [
                0.16907575726509094,
                0.7558803558349609,
                -0.27217137813568115,
                0.570947527885437
            ],
            "translation" : [
                4.076245307922363,
                5.903861999511719,
                -1.0054539442062378
            ]
        },
        {
            "name" : "Camera",
            "rotation" : [
                0.483536034822464,
                0.33687159419059753,
                -0.20870360732078552,
                0.7804827094078064
            ],
            "translation" : [
                7.358891487121582,
                4.958309173583984,
                6.925790786743164
            ]
        },
        {
            "mesh" : 0,
            "name" : "Plane"
        }
    ],
    "materials" : [
        {
            "doubleSided" : true,
            "emissiveFactor" : [
                0,
                0,
                0
            ],
            "name" : "Red",
            "pbrMetallicRoughness" : {
                "baseColorFactor" : [
                    0.2956925630569458,
                    0.03304370865225792,
                    0.043006643652915955,
                    1
                ],
                "metallicFactor" : 0,
                "roughnessFactor" : 0.5
            }
        },
        {
            "doubleSided" : true,
            "emissiveFactor" : [
                0,
                0,
                0
            ],
            "name" : "Black",
            "pbrMetallicRoughness" : {
                "baseColorFactor" : [
                    0,
                    0,
                    0,
                    1
                ],
                "metallicFactor" : 0,
                "roughnessFactor" : 1
            }
        },
        {
            "doubleSided" : true,
            "emissiveFactor" : [
                0,
                0,
                0
            ],
            "name" : "White",
            "pbrMetallicRoughness" : {
                "baseColorFactor" : [
                    0.800000011920929,
                    0.800000011920929,
                    0.800000011920929,
                    1
                ],
                "metallicFactor" : 0,
                "roughnessFactor" : 1
            }
        }
    ],
    "meshes" : [
        {
            "name" : "Plane",
            "primitives" : [
                {
                    "attributes" : {
                        "POSITION" : 0,
                        "NORMAL" : 1,
                        "TANGENT" : 2,
                        "TEXCOORD_0" : 3
                    },
                    "indices" : 4,
                    "material" : 0
                },
                {
                    "attributes" : {
                        "POSITION" : 5,
                        "NORMAL" : 6,
                        "TANGENT" : 7,
                        "TEXCOORD_0" : 8
                    },
                    "indices" : 9,
                    "material" : 1
                },
                {
                    "attributes" : {
                        "POSITION" : 10,
                        "NORMAL" : 11,
                        "TANGENT" : 12,
                        "TEXCOORD_0" : 13
                    },
                    "indices" : 14,
                    "material" : 2
                }
            ]
        }
    ],
    "accessors" : [
        {
            "bufferView" : 0,
            "componentType" : 5126,
            "count" : 3874,
            "max" : [
                0.09238220751285553,
                0.034201379865407944,
                0.24642501771450043
            ],
            "min" : [
                -0.09238221496343613,
                0,
                -0.24865032732486725
            ],
            "type" : "VEC3"
        },
        {
            "bufferView" : 1,
            "componentType" : 5126,
            "count" : 3874,
            "type" : "VEC3"
        },
        {
            "bufferView" : 2,
            "componentType" : 5126,
            "count" : 3874,
            "type" : "VEC4"
        },
        {
            "bufferView" : 3,
            "componentType" : 5126,
            "count" : 3874,
            "type" : "VEC2"
        },
        {
            "bufferView" : 4,
            "componentType" : 5123,
            "count" : 15456,
            "type" : "SCALAR"
        },
        {
            "bufferView" : 5,
            "componentType" : 5126,
            "count" : 580,
            "max" : [
                0.07318234443664551,
                0.034201379865407944,
                0.21393299102783203
            ],
            "min" : [
                -0.07343252748250961,
                0.034201376140117645,
                -0.06393091380596161
            ],
            "type" : "VEC3"
        },
        {
            "bufferView" : 6,
            "componentType" : 5126,
            "count" : 580,
            "type" : "VEC3"
        },
        {
            "bufferView" : 7,
            "componentType" : 5126,
            "count" : 580,
            "type" : "VEC4"
        },
        {
            "bufferView" : 8,
            "componentType" : 5126,
            "count" : 580,
            "type" : "VEC2"
        },
        {
            "bufferView" : 9,
            "componentType" : 5123,
            "count" : 2592,
            "type" : "SCALAR"
        },
        {
            "bufferView" : 10,
            "componentType" : 5126,
            "count" : 240,
            "max" : [
                0.06038879603147507,
                0.034201379865407944,
                0.19666053354740143
            ],
            "min" : [
                -0.060388799756765366,
                0.034201376140117645,
                -0.044897522777318954
            ],
            "type" : "VEC3"
        },
        {
            "bufferView" : 11,
            "componentType" : 5126,
            "count" : 240,
            "type" : "VEC3"
        },
        {
            "bufferView" : 12,
            "componentType" : 5126,
            "count" : 240,
            "type" : "VEC4"
        },
        {
            "bufferView" : 13,
            "componentType" : 5126,
            "count" : 240,
            "type" : "VEC2"
        },
        {
            "bufferView" : 14,
            "componentType" : 5123,
            "count" : 768,
            "type" : "SCALAR"
        }
    ],
    "bufferViews" : [
        {
            "buffer" : 0,
            "byteLength" : 46488,
            "byteOffset" : 0
        },
        {
            "buffer" : 0,
            "byteLength" : 46488,
            "byteOffset" : 46488
        },
        {
            "buffer" : 0,
            "byteLength" : 61984,
            "byteOffset" : 92976
        },
        {
            "buffer" : 0,
            "byteLength" : 30992,
            "byteOffset" : 154960
        },
        {
            "buffer" : 0,
            "byteLength" : 30912,
            "byteOffset" : 185952
        },
        {
            "buffer" : 0,
            "byteLength" : 6960,
            "byteOffset" : 216864
        },
        {
            "buffer" : 0,
            "byteLength" : 6960,
            "byteOffset" : 223824
        },
        {
            "buffer" : 0,
            "byteLength" : 9280,
            "byteOffset" : 230784
        },
        {
            "buffer" : 0,
            "byteLength" : 4640,
            "byteOffset" : 240064
        },
        {
            "buffer" : 0,
            "byteLength" : 5184,
            "byteOffset" : 244704
        },
        {
            "buffer" : 0,
            "byteLength" : 2880,
            "byteOffset" : 249888
        },
        {
            "buffer" : 0,
            "byteLength" : 2880,
            "byteOffset" : 252768
        },
        {
            "buffer" : 0,
            "byteLength" : 3840,
            "byteOffset" : 255648
        },
        {
            "buffer" : 0,
            "byteLength" : 1920,
            "byteOffset" : 259488
        },
        {
            "buffer" : 0,
            "byteLength" : 1536,
            "byteOffset" : 261408
        }
    ],
    "buffers" : [
        {
            "byteLength" : 262944,
            "uri" : "cb_radio.bin"
        }
    ]
}
