{
    "asset" : {
        "generator" : "Khronos glTF Blender I/O v1.3.48",
        "version" : "2.0"
    },
    "extensionsUsed" : [
        "KHR_materials_clearcoat"
    ],
    "scene" : 0,
    "scenes" : [
        {
            "name" : "Scene",
            "nodes" : [
                0,
                1,
                2
            ]
        }
    ],
    "nodes" : [
        {
            "mesh" : 0,
            "name" : "Body-col",
            "translation" : [
                0,
                1.6870490312576294,
                0
            ]
        },
        {
            "mesh" : 1,
            "name" : "Wheels"
        },
        {
            "mesh" : 2,
            "name" : "Tray",
            "translation" : [
                0,
                0.7835163474082947,
                -2.349809408187866
            ]
        }
    ],
    "materials" : [
        {
            "doubleSided" : true,
            "emissiveFactor" : [
                0,
                0,
                0
            ],
            "extensions" : {
                "KHR_materials_clearcoat" : {
                    "clearcoatFactor" : 0.06666667014360428,
                    "clearcoatRoughnessFactor" : 0.48185184597969055
                }
            },
            "name" : "Paint",
            "pbrMetallicRoughness" : {
                "baseColorFactor" : [
                    0.8000000715255737,
                    0.018159816041588783,
                    0.013498823158442974,
                    1
                ],
                "metallicFactor" : 0,
                "roughnessFactor" : 0.5
            }
        },
        {
            "doubleSided" : true,
            "emissiveFactor" : [
                0,
                0,
                0
            ],
            "name" : "Window",
            "pbrMetallicRoughness" : {
                "baseColorFactor" : [
                    0,
                    0,
                    0,
                    1
                ],
                "metallicFactor" : 0,
                "roughnessFactor" : 1
            }
        },
        {
            "doubleSided" : true,
            "emissiveFactor" : [
                0,
                0,
                0
            ],
            "name" : "Tray",
            "pbrMetallicRoughness" : {
                "baseColorFactor" : [
                    0.5173337459564209,
                    0.5173337459564209,
                    0.5173337459564209,
                    1
                ],
                "metallicFactor" : 0,
                "roughnessFactor" : 0.5
            }
        },
        {
            "doubleSided" : true,
            "emissiveFactor" : [
                0,
                0,
                0
            ],
            "name" : "Light",
            "pbrMetallicRoughness" : {
                "baseColorFactor" : [
                    0.800000011920929,
                    0.800000011920929,
                    0.800000011920929,
                    1
                ],
                "metallicFactor" : 0,
                "roughnessFactor" : 1
            }
        },
        {
            "doubleSided" : true,
            "emissiveFactor" : [
                0,
                0,
                0
            ],
            "name" : "Plate",
            "pbrMetallicRoughness" : {
                "baseColorFactor" : [
                    0.028709670528769493,
                    0.15559335052967072,
                    0.8000000715255737,
                    1
                ],
                "metallicFactor" : 0,
                "roughnessFactor" : 0.5
            }
        }
    ],
    "meshes" : [
        {
            "name" : "Plane",
            "primitives" : [
                {
                    "attributes" : {
                        "POSITION" : 0,
                        "NORMAL" : 1,
                        "TEXCOORD_0" : 2
                    },
                    "indices" : 3,
                    "material" : 0
                },
                {
                    "attributes" : {
                        "POSITION" : 4,
                        "NORMAL" : 5,
                        "TEXCOORD_0" : 6
                    },
                    "indices" : 7,
                    "material" : 1
                },
                {
                    "attributes" : {
                        "POSITION" : 8,
                        "NORMAL" : 9,
                        "TEXCOORD_0" : 10
                    },
                    "indices" : 11,
                    "material" : 2
                },
                {
                    "attributes" : {
                        "POSITION" : 12,
                        "NORMAL" : 13,
                        "TEXCOORD_0" : 14
                    },
                    "indices" : 15,
                    "material" : 3
                },
                {
                    "attributes" : {
                        "POSITION" : 16,
                        "NORMAL" : 17,
                        "TEXCOORD_0" : 18
                    },
                    "indices" : 19,
                    "material" : 4
                }
            ]
        },
        {
            "name" : "Circle",
            "primitives" : [
                {
                    "attributes" : {
                        "POSITION" : 20,
                        "NORMAL" : 21,
                        "TANGENT" : 22,
                        "TEXCOORD_0" : 23
                    },
                    "indices" : 24,
                    "material" : 1
                },
                {
                    "attributes" : {
                        "POSITION" : 25,
                        "NORMAL" : 26,
                        "TANGENT" : 27,
                        "TEXCOORD_0" : 28
                    },
                    "indices" : 29,
                    "material" : 3
                }
            ]
        },
        {
            "name" : "Plane.001",
            "primitives" : [
                {
                    "attributes" : {
                        "POSITION" : 30,
                        "NORMAL" : 31,
                        "TANGENT" : 32,
                        "TEXCOORD_0" : 33
                    },
                    "indices" : 34,
                    "material" : 0
                },
                {
                    "attributes" : {
                        "POSITION" : 35,
                        "NORMAL" : 36,
                        "TANGENT" : 37,
                        "TEXCOORD_0" : 38
                    },
                    "indices" : 39,
                    "material" : 2
                }
            ]
        }
    ],
    "accessors" : [
        {
            "bufferView" : 0,
            "componentType" : 5126,
            "count" : 4020,
            "max" : [
                0.9312591552734375,
                0.0049100518226623535,
                2.3319125175476074
            ],
            "min" : [
                -0.9312591552734375,
                -1.4688715934753418,
                -2.3561484813690186
            ],
            "type" : "VEC3"
        },
        {
            "bufferView" : 1,
            "componentType" : 5126,
            "count" : 4020,
            "type" : "VEC3"
        },
        {
            "bufferView" : 2,
            "componentType" : 5126,
            "count" : 4020,
            "type" : "VEC2"
        },
        {
            "bufferView" : 3,
            "componentType" : 5123,
            "count" : 15588,
            "type" : "SCALAR"
        },
        {
            "bufferView" : 4,
            "componentType" : 5126,
            "count" : 560,
            "max" : [
                0.8542113900184631,
                -0.005732253193855286,
                1.7457870244979858
            ],
            "min" : [
                -0.8542113900184631,
                -1.413648009300232,
                -1.9421508312225342
            ],
            "type" : "VEC3"
        },
        {
            "bufferView" : 5,
            "componentType" : 5126,
            "count" : 560,
            "type" : "VEC3"
        },
        {
            "bufferView" : 6,
            "componentType" : 5126,
            "count" : 560,
            "type" : "VEC2"
        },
        {
            "bufferView" : 7,
            "componentType" : 5123,
            "count" : 1896,
            "type" : "SCALAR"
        },
        {
            "bufferView" : 8,
            "componentType" : 5126,
            "count" : 220,
            "max" : [
                0.7561858892440796,
                -0.450743705034256,
                -0.44788485765457153
            ],
            "min" : [
                -0.7561858892440796,
                -0.9035326838493347,
                -2.349809408187866
            ],
            "type" : "VEC3"
        },
        {
            "bufferView" : 9,
            "componentType" : 5126,
            "count" : 220,
            "type" : "VEC3"
        },
        {
            "bufferView" : 10,
            "componentType" : 5126,
            "count" : 220,
            "type" : "VEC2"
        },
        {
            "bufferView" : 11,
            "componentType" : 5123,
            "count" : 690,
            "type" : "SCALAR"
        },
        {
            "bufferView" : 12,
            "componentType" : 5126,
            "count" : 377,
            "max" : [
                0.8502584099769592,
                -0.7982200980186462,
                2.322836399078369
            ],
            "min" : [
                -0.8502584099769592,
                -1.2119972705841064,
                2.2078709602355957
            ],
            "type" : "VEC3"
        },
        {
            "bufferView" : 13,
            "componentType" : 5126,
            "count" : 377,
            "type" : "VEC3"
        },
        {
            "bufferView" : 14,
            "componentType" : 5126,
            "count" : 377,
            "type" : "VEC2"
        },
        {
            "bufferView" : 15,
            "componentType" : 5123,
            "count" : 978,
            "type" : "SCALAR"
        },
        {
            "bufferView" : 16,
            "componentType" : 5126,
            "count" : 105,
            "max" : [
                0.2740475535392761,
                -1.0404162406921387,
                2.3319125175476074
            ],
            "min" : [
                -0.2740475535392761,
                -1.198312520980835,
                -2.3561484813690186
            ],
            "type" : "VEC3"
        },
        {
            "bufferView" : 17,
            "componentType" : 5126,
            "count" : 105,
            "type" : "VEC3"
        },
        {
            "bufferView" : 18,
            "componentType" : 5126,
            "count" : 105,
            "type" : "VEC2"
        },
        {
            "bufferView" : 19,
            "componentType" : 5123,
            "count" : 240,
            "type" : "SCALAR"
        },
        {
            "bufferView" : 20,
            "componentType" : 5126,
            "count" : 4992,
            "max" : [
                0.9854391813278198,
                0.8094956874847412,
                1.7126541137695312
            ],
            "min" : [
                -0.9854391813278198,
                -0.004507243633270264,
                -1.9350687265396118
            ],
            "type" : "VEC3"
        },
        {
            "bufferView" : 21,
            "componentType" : 5126,
            "count" : 4992,
            "type" : "VEC3"
        },
        {
            "bufferView" : 22,
            "componentType" : 5126,
            "count" : 4992,
            "type" : "VEC4"
        },
        {
            "bufferView" : 23,
            "componentType" : 5126,
            "count" : 4992,
            "type" : "VEC2"
        },
        {
            "bufferView" : 24,
            "componentType" : 5123,
            "count" : 24576,
            "type" : "SCALAR"
        },
        {
            "bufferView" : 25,
            "componentType" : 5126,
            "count" : 10112,
            "max" : [
                0.9820156693458557,
                0.7078163623809814,
                1.6109745502471924
            ],
            "min" : [
                -0.9820156693458557,
                0.09717213362455368,
                -1.833389401435852
            ],
            "type" : "VEC3"
        },
        {
            "bufferView" : 26,
            "componentType" : 5126,
            "count" : 10112,
            "type" : "VEC3"
        },
        {
            "bufferView" : 27,
            "componentType" : 5126,
            "count" : 10112,
            "type" : "VEC4"
        },
        {
            "bufferView" : 28,
            "componentType" : 5126,
            "count" : 10112,
            "type" : "VEC2"
        },
        {
            "bufferView" : 29,
            "componentType" : 5123,
            "count" : 38352,
            "type" : "SCALAR"
        },
        {
            "bufferView" : 30,
            "componentType" : 5126,
            "count" : 93,
            "max" : [
                0.7555267214775085,
                0.4242919981479645,
                0.03941585123538971
            ],
            "min" : [
                -0.7555267214775085,
                0.005992194637656212,
                -0.06228633597493172
            ],
            "type" : "VEC3"
        },
        {
            "bufferView" : 31,
            "componentType" : 5126,
            "count" : 93,
            "type" : "VEC3"
        },
        {
            "bufferView" : 32,
            "componentType" : 5126,
            "count" : 93,
            "type" : "VEC4"
        },
        {
            "bufferView" : 33,
            "componentType" : 5126,
            "count" : 93,
            "type" : "VEC2"
        },
        {
            "bufferView" : 34,
            "componentType" : 5123,
            "count" : 384,
            "type" : "SCALAR"
        },
        {
            "bufferView" : 35,
            "componentType" : 5126,
            "count" : 106,
            "max" : [
                0.7547610998153687,
                0.4242919981479645,
                0.040265899151563644
            ],
            "min" : [
                -0.7547610998153687,
                0.004438708536326885,
                -0.06207568198442459
            ],
            "type" : "VEC3"
        },
        {
            "bufferView" : 36,
            "componentType" : 5126,
            "count" : 106,
            "type" : "VEC3"
        },
        {
            "bufferView" : 37,
            "componentType" : 5126,
            "count" : 106,
            "type" : "VEC4"
        },
        {
            "bufferView" : 38,
            "componentType" : 5126,
            "count" : 106,
            "type" : "VEC2"
        },
        {
            "bufferView" : 39,
            "componentType" : 5123,
            "count" : 432,
            "type" : "SCALAR"
        }
    ],
    "bufferViews" : [
        {
            "buffer" : 0,
            "byteLength" : 48240,
            "byteOffset" : 0
        },
        {
            "buffer" : 0,
            "byteLength" : 48240,
            "byteOffset" : 48240
        },
        {
            "buffer" : 0,
            "byteLength" : 32160,
            "byteOffset" : 96480
        },
        {
            "buffer" : 0,
            "byteLength" : 31176,
            "byteOffset" : 128640
        },
        {
            "buffer" : 0,
            "byteLength" : 6720,
            "byteOffset" : 159816
        },
        {
            "buffer" : 0,
            "byteLength" : 6720,
            "byteOffset" : 166536
        },
        {
            "buffer" : 0,
            "byteLength" : 4480,
            "byteOffset" : 173256
        },
        {
            "buffer" : 0,
            "byteLength" : 3792,
            "byteOffset" : 177736
        },
        {
            "buffer" : 0,
            "byteLength" : 2640,
            "byteOffset" : 181528
        },
        {
            "buffer" : 0,
            "byteLength" : 2640,
            "byteOffset" : 184168
        },
        {
            "buffer" : 0,
            "byteLength" : 1760,
            "byteOffset" : 186808
        },
        {
            "buffer" : 0,
            "byteLength" : 1380,
            "byteOffset" : 188568
        },
        {
            "buffer" : 0,
            "byteLength" : 4524,
            "byteOffset" : 189948
        },
        {
            "buffer" : 0,
            "byteLength" : 4524,
            "byteOffset" : 194472
        },
        {
            "buffer" : 0,
            "byteLength" : 3016,
            "byteOffset" : 198996
        },
        {
            "buffer" : 0,
            "byteLength" : 1956,
            "byteOffset" : 202012
        },
        {
            "buffer" : 0,
            "byteLength" : 1260,
            "byteOffset" : 203968
        },
        {
            "buffer" : 0,
            "byteLength" : 1260,
            "byteOffset" : 205228
        },
        {
            "buffer" : 0,
            "byteLength" : 840,
            "byteOffset" : 206488
        },
        {
            "buffer" : 0,
            "byteLength" : 480,
            "byteOffset" : 207328
        },
        {
            "buffer" : 0,
            "byteLength" : 59904,
            "byteOffset" : 207808
        },
        {
            "buffer" : 0,
            "byteLength" : 59904,
            "byteOffset" : 267712
        },
        {
            "buffer" : 0,
            "byteLength" : 79872,
            "byteOffset" : 327616
        },
        {
            "buffer" : 0,
            "byteLength" : 39936,
            "byteOffset" : 407488
        },
        {
            "buffer" : 0,
            "byteLength" : 49152,
            "byteOffset" : 447424
        },
        {
            "buffer" : 0,
            "byteLength" : 121344,
            "byteOffset" : 496576
        },
        {
            "buffer" : 0,
            "byteLength" : 121344,
            "byteOffset" : 617920
        },
        {
            "buffer" : 0,
            "byteLength" : 161792,
            "byteOffset" : 739264
        },
        {
            "buffer" : 0,
            "byteLength" : 80896,
            "byteOffset" : 901056
        },
        {
            "buffer" : 0,
            "byteLength" : 76704,
            "byteOffset" : 981952
        },
        {
            "buffer" : 0,
            "byteLength" : 1116,
            "byteOffset" : 1058656
        },
        {
            "buffer" : 0,
            "byteLength" : 1116,
            "byteOffset" : 1059772
        },
        {
            "buffer" : 0,
            "byteLength" : 1488,
            "byteOffset" : 1060888
        },
        {
            "buffer" : 0,
            "byteLength" : 744,
            "byteOffset" : 1062376
        },
        {
            "buffer" : 0,
            "byteLength" : 768,
            "byteOffset" : 1063120
        },
        {
            "buffer" : 0,
            "byteLength" : 1272,
            "byteOffset" : 1063888
        },
        {
            "buffer" : 0,
            "byteLength" : 1272,
            "byteOffset" : 1065160
        },
        {
            "buffer" : 0,
            "byteLength" : 1696,
            "byteOffset" : 1066432
        },
        {
            "buffer" : 0,
            "byteLength" : 848,
            "byteOffset" : 1068128
        },
        {
            "buffer" : 0,
            "byteLength" : 864,
            "byteOffset" : 1068976
        }
    ],
    "buffers" : [
        {
            "byteLength" : 1069840,
            "uri" : "ute.bin"
        }
    ]
}
