{
    "asset" : {
        "generator" : "Khronos glTF Blender I/O v1.3.48",
        "version" : "2.0"
    },
    "scene" : 0,
    "scenes" : [
        {
            "name" : "Scene",
            "nodes" : [
                0,
                1,
                2,
                3,
                6,
                9
            ]
        }
    ],
    "nodes" : [
        {
            "mesh" : 0,
            "name" : "Body",
            "translation" : [
                0,
                0.5349236130714417,
                0
            ]
        },
        {
            "mesh" : 1,
            "name" : "Spine",
            "translation" : [
                0,
                0.5349236130714417,
                0
            ]
        },
        {
            "mesh" : 2,
            "name" : "Wire",
            "translation" : [
                0,
                -0.21507643163204193,
                0
            ]
        },
        {
            "mesh" : 3,
            "name" : "Circle",
            "rotation" : [
                0,
                -0.14272628724575043,
                0,
                0.9897623062133789
            ],
            "translation" : [
                -0.02592405304312706,
                1.4433897733688354,
                0.04342152550816536
            ]
        },
        {
            "mesh" : 4,
            "name" : "Foot",
            "rotation" : [
                -0.06313761323690414,
                -0.06313761323690414,
                -0.7042824029922485,
                0.7042824029922485
            ],
            "translation" : [
                0.003888845443725586,
                0.0007856115698814392,
                0.249214306473732
            ]
        },
        {
            "children" : [
                4
            ],
            "mesh" : 5,
            "name" : "Shin",
            "rotation" : [
                0.3350992202758789,
                0,
                0,
                0.9421828389167786
            ],
            "translation" : [
                -0.009999997913837433,
                0,
                0.25
            ]
        },
        {
            "children" : [
                5
            ],
            "mesh" : 6,
            "name" : "Thigh",
            "rotation" : [
                0.5184614658355713,
                0,
                0,
                0.8551011085510254
            ],
            "translation" : [
                -0.08070749044418335,
                0.5169308185577393,
                0
            ]
        },
        {
            "mesh" : 7,
            "name" : "Foot.001",
            "rotation" : [
                -0.06313762068748474,
                -0.06313762068748474,
                -0.7042824029922485,
                0.7042824029922485
            ],
            "translation" : [
                0.003888830542564392,
                0.0007856898009777069,
                0.24921424686908722
            ]
        },
        {
            "children" : [
                7
            ],
            "mesh" : 8,
            "name" : "Shin.001",
            "rotation" : [
                -0.7276813983917236,
                0,
                0,
                0.6859152913093567
            ],
            "translation" : [
                -0.01000000536441803,
                0,
                0.2499999850988388
            ]
        },
        {
            "children" : [
                8
            ],
            "mesh" : 9,
            "name" : "Arms",
            "rotation" : [
                0.7852537035942078,
                0,
                0,
                0.6191743016242981
            ],
            "translation" : [
                -0.1495000422000885,
                1.2707877159118652,
                0.012988448143005371
            ]
        }
    ],
    "materials" : [
        {
            "doubleSided" : true,
            "emissiveFactor" : [
                0,
                0,
                0
            ],
            "name" : "Metal",
            "pbrMetallicRoughness" : {
                "baseColorFactor" : [
                    0.3423835337162018,
                    0.3423835337162018,
                    0.3423835337162018,
                    1
                ],
                "metallicFactor" : 1,
                "roughnessFactor" : 0.2925925850868225
            }
        },
        {
            "doubleSided" : true,
            "emissiveFactor" : [
                0,
                0,
                0
            ],
            "name" : "Light",
            "pbrMetallicRoughness" : {
                "baseColorFactor" : [
                    0.8000000715255737,
                    0.603013277053833,
                    0.1951887309551239,
                    1
                ],
                "metallicFactor" : 0,
                "roughnessFactor" : 0.5
            }
        },
        {
            "doubleSided" : true,
            "emissiveFactor" : [
                0,
                0,
                0
            ],
            "name" : "Plug",
            "pbrMetallicRoughness" : {
                "baseColorFactor" : [
                    0.6859572529792786,
                    0.5737470984458923,
                    0.23985454440116882,
                    1
                ],
                "metallicFactor" : 0,
                "roughnessFactor" : 0.5
            }
        },
        {
            "doubleSided" : true,
            "emissiveFactor" : [
                0,
                0,
                0
            ],
            "name" : "WireRed",
            "pbrMetallicRoughness" : {
                "baseColorFactor" : [
                    0.8000000715255737,
                    0.030581561848521233,
                    0.04616900905966759,
                    1
                ],
                "metallicFactor" : 0,
                "roughnessFactor" : 0.5
            }
        },
        {
            "doubleSided" : true,
            "emissiveFactor" : [
                0,
                0,
                0
            ],
            "name" : "WireYellow",
            "pbrMetallicRoughness" : {
                "baseColorFactor" : [
                    0.8000000715255737,
                    0.6146050095558167,
                    0.012253149412572384,
                    1
                ],
                "metallicFactor" : 0,
                "roughnessFactor" : 0.5
            }
        },
        {
            "doubleSided" : true,
            "emissiveFactor" : [
                0,
                0,
                0
            ],
            "name" : "WireBlue",
            "pbrMetallicRoughness" : {
                "baseColorFactor" : [
                    0.07791972160339355,
                    0.2618952691555023,
                    0.8000000715255737,
                    1
                ],
                "metallicFactor" : 0,
                "roughnessFactor" : 0.5
            }
        },
        {
            "doubleSided" : true,
            "emissiveFactor" : [
                0,
                0,
                0
            ],
            "name" : "WireGreen",
            "pbrMetallicRoughness" : {
                "baseColorFactor" : [
                    0.03156445175409317,
                    0.35055580735206604,
                    0.08345047384500504,
                    1
                ],
                "metallicFactor" : 0,
                "roughnessFactor" : 0.5
            }
        },
        {
            "doubleSided" : true,
            "emissiveFactor" : [
                0,
                0,
                0
            ],
            "name" : "WirePink",
            "pbrMetallicRoughness" : {
                "baseColorFactor" : [
                    0.8000000715255737,
                    0.37421518564224243,
                    0.4532649517059326,
                    1
                ],
                "metallicFactor" : 0,
                "roughnessFactor" : 0.5
            }
        },
        {
            "doubleSided" : true,
            "emissiveFactor" : [
                0,
                0,
                0
            ],
            "name" : "WirePurple",
            "pbrMetallicRoughness" : {
                "baseColorFactor" : [
                    0.297104150056839,
                    0.01295738946646452,
                    0.8000000715255737,
                    1
                ],
                "metallicFactor" : 0,
                "roughnessFactor" : 0.5
            }
        },
        {
            "doubleSided" : true,
            "emissiveFactor" : [
                0,
                0,
                0
            ],
            "name" : "WireBrown",
            "pbrMetallicRoughness" : {
                "baseColorFactor" : [
                    0.19017808139324188,
                    0.06497962772846222,
                    0.01865336112678051,
                    1
                ],
                "metallicFactor" : 0,
                "roughnessFactor" : 0.5
            }
        }
    ],
    "meshes" : [
        {
            "name" : "Circle",
            "primitives" : [
                {
                    "attributes" : {
                        "POSITION" : 0,
                        "NORMAL" : 1,
                        "TANGENT" : 2,
                        "TEXCOORD_0" : 3
                    },
                    "indices" : 4,
                    "material" : 0
                },
                {
                    "attributes" : {
                        "POSITION" : 5,
                        "NORMAL" : 6,
                        "TANGENT" : 7,
                        "TEXCOORD_0" : 8
                    },
                    "indices" : 9,
                    "material" : 1
                }
            ]
        },
        {
            "name" : "Circle.001",
            "primitives" : [
                {
                    "attributes" : {
                        "POSITION" : 10,
                        "NORMAL" : 11,
                        "TANGENT" : 12,
                        "TEXCOORD_0" : 13
                    },
                    "indices" : 14,
                    "material" : 0
                }
            ]
        },
        {
            "name" : "Circle.002",
            "primitives" : [
                {
                    "attributes" : {
                        "POSITION" : 15,
                        "NORMAL" : 16,
                        "TANGENT" : 17,
                        "TEXCOORD_0" : 18
                    },
                    "indices" : 19,
                    "material" : 2
                },
                {
                    "attributes" : {
                        "POSITION" : 20,
                        "NORMAL" : 21,
                        "TANGENT" : 22,
                        "TEXCOORD_0" : 23
                    },
                    "indices" : 24,
                    "material" : 3
                },
                {
                    "attributes" : {
                        "POSITION" : 25,
                        "NORMAL" : 26,
                        "TANGENT" : 27,
                        "TEXCOORD_0" : 28
                    },
                    "indices" : 29,
                    "material" : 4
                },
                {
                    "attributes" : {
                        "POSITION" : 30,
                        "NORMAL" : 31,
                        "TANGENT" : 32,
                        "TEXCOORD_0" : 33
                    },
                    "indices" : 29,
                    "material" : 5
                },
                {
                    "attributes" : {
                        "POSITION" : 34,
                        "NORMAL" : 35,
                        "TANGENT" : 36,
                        "TEXCOORD_0" : 37
                    },
                    "indices" : 29,
                    "material" : 6
                },
                {
                    "attributes" : {
                        "POSITION" : 38,
                        "NORMAL" : 39,
                        "TANGENT" : 40,
                        "TEXCOORD_0" : 41
                    },
                    "indices" : 29,
                    "material" : 7
                },
                {
                    "attributes" : {
                        "POSITION" : 42,
                        "NORMAL" : 43,
                        "TANGENT" : 44,
                        "TEXCOORD_0" : 45
                    },
                    "indices" : 29,
                    "material" : 8
                },
                {
                    "attributes" : {
                        "POSITION" : 46,
                        "NORMAL" : 47,
                        "TANGENT" : 48,
                        "TEXCOORD_0" : 49
                    },
                    "indices" : 24,
                    "material" : 9
                }
            ]
        },
        {
            "name" : "Circle.003",
            "primitives" : [
                {
                    "attributes" : {
                        "POSITION" : 50,
                        "NORMAL" : 51,
                        "TEXCOORD_0" : 52
                    },
                    "indices" : 53,
                    "material" : 0
                },
                {
                    "attributes" : {
                        "POSITION" : 54,
                        "NORMAL" : 55,
                        "TEXCOORD_0" : 56
                    },
                    "indices" : 57,
                    "material" : 1
                }
            ]
        },
        {
            "name" : "Plane",
            "primitives" : [
                {
                    "attributes" : {
                        "POSITION" : 58,
                        "NORMAL" : 59,
                        "TANGENT" : 60,
                        "TEXCOORD_0" : 61
                    },
                    "indices" : 62,
                    "material" : 0
                }
            ]
        },
        {
            "name" : "Circle.005",
            "primitives" : [
                {
                    "attributes" : {
                        "POSITION" : 63,
                        "NORMAL" : 64,
                        "TANGENT" : 65,
                        "TEXCOORD_0" : 66
                    },
                    "indices" : 67,
                    "material" : 0
                }
            ]
        },
        {
            "name" : "Circle.004",
            "primitives" : [
                {
                    "attributes" : {
                        "POSITION" : 68,
                        "NORMAL" : 69,
                        "TANGENT" : 70,
                        "TEXCOORD_0" : 71
                    },
                    "indices" : 67,
                    "material" : 0
                }
            ]
        },
        {
            "name" : "Plane.001",
            "primitives" : [
                {
                    "attributes" : {
                        "POSITION" : 72,
                        "NORMAL" : 73,
                        "TEXCOORD_0" : 74
                    },
                    "indices" : 75,
                    "material" : 0
                }
            ]
        },
        {
            "name" : "Circle.007",
            "primitives" : [
                {
                    "attributes" : {
                        "POSITION" : 76,
                        "NORMAL" : 77,
                        "TANGENT" : 78,
                        "TEXCOORD_0" : 79
                    },
                    "indices" : 67,
                    "material" : 0
                }
            ]
        },
        {
            "name" : "Circle.006",
            "primitives" : [
                {
                    "attributes" : {
                        "POSITION" : 80,
                        "NORMAL" : 81,
                        "TANGENT" : 82,
                        "TEXCOORD_0" : 83
                    },
                    "indices" : 67,
                    "material" : 0
                }
            ]
        }
    ],
    "accessors" : [
        {
            "bufferView" : 0,
            "componentType" : 5126,
            "count" : 520,
            "max" : [
                0.14999987185001373,
                0.9999999403953552,
                0.1499999761581421
            ],
            "min" : [
                -0.14999987185001373,
                0,
                -0.1499999761581421
            ],
            "type" : "VEC3"
        },
        {
            "bufferView" : 1,
            "componentType" : 5126,
            "count" : 520,
            "type" : "VEC3"
        },
        {
            "bufferView" : 2,
            "componentType" : 5126,
            "count" : 520,
            "type" : "VEC4"
        },
        {
            "bufferView" : 3,
            "componentType" : 5126,
            "count" : 520,
            "type" : "VEC2"
        },
        {
            "bufferView" : 4,
            "componentType" : 5123,
            "count" : 2280,
            "type" : "SCALAR"
        },
        {
            "bufferView" : 5,
            "componentType" : 5126,
            "count" : 28,
            "max" : [
                0.06396663933992386,
                0.812256932258606,
                0.09223118424415588
            ],
            "min" : [
                -0.06396663933992386,
                0.7988389134407043,
                0.0658266544342041
            ],
            "type" : "VEC3"
        },
        {
            "bufferView" : 6,
            "componentType" : 5126,
            "count" : 28,
            "type" : "VEC3"
        },
        {
            "bufferView" : 7,
            "componentType" : 5126,
            "count" : 28,
            "type" : "VEC4"
        },
        {
            "bufferView" : 8,
            "componentType" : 5126,
            "count" : 28,
            "type" : "VEC2"
        },
        {
            "bufferView" : 9,
            "componentType" : 5123,
            "count" : 108,
            "type" : "SCALAR"
        },
        {
            "bufferView" : 10,
            "componentType" : 5126,
            "count" : 4624,
            "max" : [
                0.05902107059955597,
                0.7399998903274536,
                0.059021469205617905
            ],
            "min" : [
                -0.05902186036109924,
                0.019999980926513672,
                -0.059021469205617905
            ],
            "type" : "VEC3"
        },
        {
            "bufferView" : 11,
            "componentType" : 5126,
            "count" : 4624,
            "type" : "VEC3"
        },
        {
            "bufferView" : 12,
            "componentType" : 5126,
            "count" : 4624,
            "type" : "VEC4"
        },
        {
            "bufferView" : 13,
            "componentType" : 5126,
            "count" : 4624,
            "type" : "VEC2"
        },
        {
            "bufferView" : 14,
            "componentType" : 5123,
            "count" : 27648,
            "type" : "SCALAR"
        },
        {
            "bufferView" : 15,
            "componentType" : 5126,
            "count" : 576,
            "max" : [
                0.11490295082330704,
                1.4800000190734863,
                0.11490295082330704
            ],
            "min" : [
                -0.11490295082330704,
                0.7700000405311584,
                -0.11490295082330704
            ],
            "type" : "VEC3"
        },
        {
            "bufferView" : 16,
            "componentType" : 5126,
            "count" : 576,
            "type" : "VEC3"
        },
        {
            "bufferView" : 17,
            "componentType" : 5126,
            "count" : 576,
            "type" : "VEC4"
        },
        {
            "bufferView" : 18,
            "componentType" : 5126,
            "count" : 576,
            "type" : "VEC2"
        },
        {
            "bufferView" : 19,
            "componentType" : 5123,
            "count" : 2304,
            "type" : "SCALAR"
        },
        {
            "bufferView" : 20,
            "componentType" : 5126,
            "count" : 16,
            "max" : [
                0.03817307949066162,
                1.4540717601776123,
                0.11078488081693649
            ],
            "min" : [
                -0.11490295082330704,
                0.7959283590316772,
                -0.0028199199587106705
            ],
            "type" : "VEC3"
        },
        {
            "bufferView" : 21,
            "componentType" : 5126,
            "count" : 16,
            "type" : "VEC3"
        },
        {
            "bufferView" : 22,
            "componentType" : 5126,
            "count" : 16,
            "type" : "VEC4"
        },
        {
            "bufferView" : 23,
            "componentType" : 5126,
            "count" : 16,
            "type" : "VEC2"
        },
        {
            "bufferView" : 24,
            "componentType" : 5123,
            "count" : 48,
            "type" : "SCALAR"
        },
        {
            "bufferView" : 25,
            "componentType" : 5126,
            "count" : 32,
            "max" : [
                0.08527787029743195,
                1.4540717601776123,
                0.11172989755868912
            ],
            "min" : [
                -0.1047218069434166,
                0.7959283590316772,
                -0.05547649413347244
            ],
            "type" : "VEC3"
        },
        {
            "bufferView" : 26,
            "componentType" : 5126,
            "count" : 32,
            "type" : "VEC3"
        },
        {
            "bufferView" : 27,
            "componentType" : 5126,
            "count" : 32,
            "type" : "VEC4"
        },
        {
            "bufferView" : 28,
            "componentType" : 5126,
            "count" : 32,
            "type" : "VEC2"
        },
        {
            "bufferView" : 29,
            "componentType" : 5123,
            "count" : 96,
            "type" : "SCALAR"
        },
        {
            "bufferView" : 30,
            "componentType" : 5126,
            "count" : 32,
            "max" : [
                0.11172991991043091,
                1.4540717601776123,
                0.1047218069434166
            ],
            "min" : [
                -0.08405673503875732,
                0.7959283590316772,
                -0.09650172293186188
            ],
            "type" : "VEC3"
        },
        {
            "bufferView" : 31,
            "componentType" : 5126,
            "count" : 32,
            "type" : "VEC3"
        },
        {
            "bufferView" : 32,
            "componentType" : 5126,
            "count" : 32,
            "type" : "VEC4"
        },
        {
            "bufferView" : 33,
            "componentType" : 5126,
            "count" : 32,
            "type" : "VEC2"
        },
        {
            "bufferView" : 34,
            "componentType" : 5126,
            "count" : 32,
            "max" : [
                0.11078489571809769,
                1.4540717601776123,
                0.11490295082330704
            ],
            "min" : [
                -0.1107848733663559,
                0.7959283590316772,
                -0.11490295082330704
            ],
            "type" : "VEC3"
        },
        {
            "bufferView" : 35,
            "componentType" : 5126,
            "count" : 32,
            "type" : "VEC3"
        },
        {
            "bufferView" : 36,
            "componentType" : 5126,
            "count" : 32,
            "type" : "VEC4"
        },
        {
            "bufferView" : 37,
            "componentType" : 5126,
            "count" : 32,
            "type" : "VEC2"
        },
        {
            "bufferView" : 38,
            "componentType" : 5126,
            "count" : 32,
            "max" : [
                0.08405673503875732,
                1.4540717601776123,
                0.09650172293186188
            ],
            "min" : [
                -0.11172988265752792,
                0.7959283590316772,
                -0.1047218069434166
            ],
            "type" : "VEC3"
        },
        {
            "bufferView" : 39,
            "componentType" : 5126,
            "count" : 32,
            "type" : "VEC3"
        },
        {
            "bufferView" : 40,
            "componentType" : 5126,
            "count" : 32,
            "type" : "VEC4"
        },
        {
            "bufferView" : 41,
            "componentType" : 5126,
            "count" : 32,
            "type" : "VEC2"
        },
        {
            "bufferView" : 42,
            "componentType" : 5126,
            "count" : 32,
            "max" : [
                0.1047218069434166,
                1.4540717601776123,
                0.05547649413347244
            ],
            "min" : [
                -0.08527787029743195,
                0.7959283590316772,
                -0.11172989010810852
            ],
            "type" : "VEC3"
        },
        {
            "bufferView" : 43,
            "componentType" : 5126,
            "count" : 32,
            "type" : "VEC3"
        },
        {
            "bufferView" : 44,
            "componentType" : 5126,
            "count" : 32,
            "type" : "VEC4"
        },
        {
            "bufferView" : 45,
            "componentType" : 5126,
            "count" : 32,
            "type" : "VEC2"
        },
        {
            "bufferView" : 46,
            "componentType" : 5126,
            "count" : 16,
            "max" : [
                0.11490295082330704,
                1.4540717601776123,
                0.0028199199587106705
            ],
            "min" : [
                -0.03817307949066162,
                0.7959283590316772,
                -0.11078488081693649
            ],
            "type" : "VEC3"
        },
        {
            "bufferView" : 47,
            "componentType" : 5126,
            "count" : 16,
            "type" : "VEC3"
        },
        {
            "bufferView" : 48,
            "componentType" : 5126,
            "count" : 16,
            "type" : "VEC4"
        },
        {
            "bufferView" : 49,
            "componentType" : 5126,
            "count" : 16,
            "type" : "VEC2"
        },
        {
            "bufferView" : 50,
            "componentType" : 5126,
            "count" : 48,
            "max" : [
                0.08106817305088043,
                0.013345571234822273,
                0.03711298853158951
            ],
            "min" : [
                -0.013345572166144848,
                -0.013345573097467422,
                -0.020069263875484467
            ],
            "type" : "VEC3"
        },
        {
            "bufferView" : 51,
            "componentType" : 5126,
            "count" : 48,
            "type" : "VEC3"
        },
        {
            "bufferView" : 52,
            "componentType" : 5126,
            "count" : 48,
            "type" : "VEC2"
        },
        {
            "bufferView" : 53,
            "componentType" : 5123,
            "count" : 192,
            "type" : "SCALAR"
        },
        {
            "bufferView" : 54,
            "componentType" : 5126,
            "count" : 96,
            "max" : [
                0.1462138444185257,
                0.029559649527072906,
                0.15040525794029236
            ],
            "min" : [
                -0.029559655115008354,
                -0.0295596644282341,
                0.009305331856012344
            ],
            "type" : "VEC3"
        },
        {
            "bufferView" : 55,
            "componentType" : 5126,
            "count" : 96,
            "type" : "VEC3"
        },
        {
            "bufferView" : 56,
            "componentType" : 5126,
            "count" : 96,
            "type" : "VEC2"
        },
        {
            "bufferView" : 57,
            "componentType" : 5123,
            "count" : 516,
            "type" : "SCALAR"
        },
        {
            "bufferView" : 58,
            "componentType" : 5126,
            "count" : 922,
            "max" : [
                0.06395553052425385,
                0.1947595626115799,
                0.04877409338951111
            ],
            "min" : [
                -0.09238812327384949,
                -0.021121487021446228,
                -0.015000446699559689
            ],
            "type" : "VEC3"
        },
        {
            "bufferView" : 59,
            "componentType" : 5126,
            "count" : 922,
            "type" : "VEC3"
        },
        {
            "bufferView" : 60,
            "componentType" : 5126,
            "count" : 922,
            "type" : "VEC4"
        },
        {
            "bufferView" : 61,
            "componentType" : 5126,
            "count" : 922,
            "type" : "VEC2"
        },
        {
            "bufferView" : 62,
            "componentType" : 5123,
            "count" : 3432,
            "type" : "SCALAR"
        },
        {
            "bufferView" : 63,
            "componentType" : 5126,
            "count" : 372,
            "max" : [
                0.18641579151153564,
                0.02000001072883606,
                0.2699999511241913
            ],
            "min" : [
                -0.005000025033950806,
                -0.020000001415610313,
                -0.019999204203486443
            ],
            "type" : "VEC3"
        },
        {
            "bufferView" : 64,
            "componentType" : 5126,
            "count" : 372,
            "type" : "VEC3"
        },
        {
            "bufferView" : 65,
            "componentType" : 5126,
            "count" : 372,
            "type" : "VEC4"
        },
        {
            "bufferView" : 66,
            "componentType" : 5126,
            "count" : 372,
            "type" : "VEC2"
        },
        {
            "bufferView" : 67,
            "componentType" : 5123,
            "count" : 864,
            "type" : "SCALAR"
        },
        {
            "bufferView" : 68,
            "componentType" : 5126,
            "count" : 372,
            "max" : [
                0.16641579568386078,
                0.02000001072883606,
                0.2699999511241913
            ],
            "min" : [
                -0.005000025033950806,
                -0.019999995827674866,
                -0.019999204203486443
            ],
            "type" : "VEC3"
        },
        {
            "bufferView" : 69,
            "componentType" : 5126,
            "count" : 372,
            "type" : "VEC3"
        },
        {
            "bufferView" : 70,
            "componentType" : 5126,
            "count" : 372,
            "type" : "VEC4"
        },
        {
            "bufferView" : 71,
            "componentType" : 5126,
            "count" : 372,
            "type" : "VEC2"
        },
        {
            "bufferView" : 72,
            "componentType" : 5126,
            "count" : 4502,
            "max" : [
                0.053869131952524185,
                0.3527411222457886,
                0.12010066956281662
            ],
            "min" : [
                -0.06612607836723328,
                -0.041517943143844604,
                -0.015000000596046448
            ],
            "type" : "VEC3"
        },
        {
            "bufferView" : 73,
            "componentType" : 5126,
            "count" : 4502,
            "type" : "VEC3"
        },
        {
            "bufferView" : 74,
            "componentType" : 5126,
            "count" : 4502,
            "type" : "VEC2"
        },
        {
            "bufferView" : 75,
            "componentType" : 5123,
            "count" : 17448,
            "type" : "SCALAR"
        },
        {
            "bufferView" : 76,
            "componentType" : 5126,
            "count" : 372,
            "max" : [
                0.32400089502334595,
                0.02000001072883606,
                0.2699999511241913
            ],
            "min" : [
                -0.005000025033950806,
                -0.019999999552965164,
                -0.019999204203486443
            ],
            "type" : "VEC3"
        },
        {
            "bufferView" : 77,
            "componentType" : 5126,
            "count" : 372,
            "type" : "VEC3"
        },
        {
            "bufferView" : 78,
            "componentType" : 5126,
            "count" : 372,
            "type" : "VEC4"
        },
        {
            "bufferView" : 79,
            "componentType" : 5126,
            "count" : 372,
            "type" : "VEC2"
        },
        {
            "bufferView" : 80,
            "componentType" : 5126,
            "count" : 372,
            "max" : [
                0.3040009140968323,
                0.02000001072883606,
                0.26999998092651367
            ],
            "min" : [
                -0.005000025033950806,
                -0.019999999552965164,
                -0.019999204203486443
            ],
            "type" : "VEC3"
        },
        {
            "bufferView" : 81,
            "componentType" : 5126,
            "count" : 372,
            "type" : "VEC3"
        },
        {
            "bufferView" : 82,
            "componentType" : 5126,
            "count" : 372,
            "type" : "VEC4"
        },
        {
            "bufferView" : 83,
            "componentType" : 5126,
            "count" : 372,
            "type" : "VEC2"
        }
    ],
    "bufferViews" : [
        {
            "buffer" : 0,
            "byteLength" : 6240,
            "byteOffset" : 0
        },
        {
            "buffer" : 0,
            "byteLength" : 6240,
            "byteOffset" : 6240
        },
        {
            "buffer" : 0,
            "byteLength" : 8320,
            "byteOffset" : 12480
        },
        {
            "buffer" : 0,
            "byteLength" : 4160,
            "byteOffset" : 20800
        },
        {
            "buffer" : 0,
            "byteLength" : 4560,
            "byteOffset" : 24960
        },
        {
            "buffer" : 0,
            "byteLength" : 336,
            "byteOffset" : 29520
        },
        {
            "buffer" : 0,
            "byteLength" : 336,
            "byteOffset" : 29856
        },
        {
            "buffer" : 0,
            "byteLength" : 448,
            "byteOffset" : 30192
        },
        {
            "buffer" : 0,
            "byteLength" : 224,
            "byteOffset" : 30640
        },
        {
            "buffer" : 0,
            "byteLength" : 216,
            "byteOffset" : 30864
        },
        {
            "buffer" : 0,
            "byteLength" : 55488,
            "byteOffset" : 31080
        },
        {
            "buffer" : 0,
            "byteLength" : 55488,
            "byteOffset" : 86568
        },
        {
            "buffer" : 0,
            "byteLength" : 73984,
            "byteOffset" : 142056
        },
        {
            "buffer" : 0,
            "byteLength" : 36992,
            "byteOffset" : 216040
        },
        {
            "buffer" : 0,
            "byteLength" : 55296,
            "byteOffset" : 253032
        },
        {
            "buffer" : 0,
            "byteLength" : 6912,
            "byteOffset" : 308328
        },
        {
            "buffer" : 0,
            "byteLength" : 6912,
            "byteOffset" : 315240
        },
        {
            "buffer" : 0,
            "byteLength" : 9216,
            "byteOffset" : 322152
        },
        {
            "buffer" : 0,
            "byteLength" : 4608,
            "byteOffset" : 331368
        },
        {
            "buffer" : 0,
            "byteLength" : 4608,
            "byteOffset" : 335976
        },
        {
            "buffer" : 0,
            "byteLength" : 192,
            "byteOffset" : 340584
        },
        {
            "buffer" : 0,
            "byteLength" : 192,
            "byteOffset" : 340776
        },
        {
            "buffer" : 0,
            "byteLength" : 256,
            "byteOffset" : 340968
        },
        {
            "buffer" : 0,
            "byteLength" : 128,
            "byteOffset" : 341224
        },
        {
            "buffer" : 0,
            "byteLength" : 96,
            "byteOffset" : 341352
        },
        {
            "buffer" : 0,
            "byteLength" : 384,
            "byteOffset" : 341448
        },
        {
            "buffer" : 0,
            "byteLength" : 384,
            "byteOffset" : 341832
        },
        {
            "buffer" : 0,
            "byteLength" : 512,
            "byteOffset" : 342216
        },
        {
            "buffer" : 0,
            "byteLength" : 256,
            "byteOffset" : 342728
        },
        {
            "buffer" : 0,
            "byteLength" : 192,
            "byteOffset" : 342984
        },
        {
            "buffer" : 0,
            "byteLength" : 384,
            "byteOffset" : 343176
        },
        {
            "buffer" : 0,
            "byteLength" : 384,
            "byteOffset" : 343560
        },
        {
            "buffer" : 0,
            "byteLength" : 512,
            "byteOffset" : 343944
        },
        {
            "buffer" : 0,
            "byteLength" : 256,
            "byteOffset" : 344456
        },
        {
            "buffer" : 0,
            "byteLength" : 384,
            "byteOffset" : 344712
        },
        {
            "buffer" : 0,
            "byteLength" : 384,
            "byteOffset" : 345096
        },
        {
            "buffer" : 0,
            "byteLength" : 512,
            "byteOffset" : 345480
        },
        {
            "buffer" : 0,
            "byteLength" : 256,
            "byteOffset" : 345992
        },
        {
            "buffer" : 0,
            "byteLength" : 384,
            "byteOffset" : 346248
        },
        {
            "buffer" : 0,
            "byteLength" : 384,
            "byteOffset" : 346632
        },
        {
            "buffer" : 0,
            "byteLength" : 512,
            "byteOffset" : 347016
        },
        {
            "buffer" : 0,
            "byteLength" : 256,
            "byteOffset" : 347528
        },
        {
            "buffer" : 0,
            "byteLength" : 384,
            "byteOffset" : 347784
        },
        {
            "buffer" : 0,
            "byteLength" : 384,
            "byteOffset" : 348168
        },
        {
            "buffer" : 0,
            "byteLength" : 512,
            "byteOffset" : 348552
        },
        {
            "buffer" : 0,
            "byteLength" : 256,
            "byteOffset" : 349064
        },
        {
            "buffer" : 0,
            "byteLength" : 192,
            "byteOffset" : 349320
        },
        {
            "buffer" : 0,
            "byteLength" : 192,
            "byteOffset" : 349512
        },
        {
            "buffer" : 0,
            "byteLength" : 256,
            "byteOffset" : 349704
        },
        {
            "buffer" : 0,
            "byteLength" : 128,
            "byteOffset" : 349960
        },
        {
            "buffer" : 0,
            "byteLength" : 576,
            "byteOffset" : 350088
        },
        {
            "buffer" : 0,
            "byteLength" : 576,
            "byteOffset" : 350664
        },
        {
            "buffer" : 0,
            "byteLength" : 384,
            "byteOffset" : 351240
        },
        {
            "buffer" : 0,
            "byteLength" : 384,
            "byteOffset" : 351624
        },
        {
            "buffer" : 0,
            "byteLength" : 1152,
            "byteOffset" : 352008
        },
        {
            "buffer" : 0,
            "byteLength" : 1152,
            "byteOffset" : 353160
        },
        {
            "buffer" : 0,
            "byteLength" : 768,
            "byteOffset" : 354312
        },
        {
            "buffer" : 0,
            "byteLength" : 1032,
            "byteOffset" : 355080
        },
        {
            "buffer" : 0,
            "byteLength" : 11064,
            "byteOffset" : 356112
        },
        {
            "buffer" : 0,
            "byteLength" : 11064,
            "byteOffset" : 367176
        },
        {
            "buffer" : 0,
            "byteLength" : 14752,
            "byteOffset" : 378240
        },
        {
            "buffer" : 0,
            "byteLength" : 7376,
            "byteOffset" : 392992
        },
        {
            "buffer" : 0,
            "byteLength" : 6864,
            "byteOffset" : 400368
        },
        {
            "buffer" : 0,
            "byteLength" : 4464,
            "byteOffset" : 407232
        },
        {
            "buffer" : 0,
            "byteLength" : 4464,
            "byteOffset" : 411696
        },
        {
            "buffer" : 0,
            "byteLength" : 5952,
            "byteOffset" : 416160
        },
        {
            "buffer" : 0,
            "byteLength" : 2976,
            "byteOffset" : 422112
        },
        {
            "buffer" : 0,
            "byteLength" : 1728,
            "byteOffset" : 425088
        },
        {
            "buffer" : 0,
            "byteLength" : 4464,
            "byteOffset" : 426816
        },
        {
            "buffer" : 0,
            "byteLength" : 4464,
            "byteOffset" : 431280
        },
        {
            "buffer" : 0,
            "byteLength" : 5952,
            "byteOffset" : 435744
        },
        {
            "buffer" : 0,
            "byteLength" : 2976,
            "byteOffset" : 441696
        },
        {
            "buffer" : 0,
            "byteLength" : 54024,
            "byteOffset" : 444672
        },
        {
            "buffer" : 0,
            "byteLength" : 54024,
            "byteOffset" : 498696
        },
        {
            "buffer" : 0,
            "byteLength" : 36016,
            "byteOffset" : 552720
        },
        {
            "buffer" : 0,
            "byteLength" : 34896,
            "byteOffset" : 588736
        },
        {
            "buffer" : 0,
            "byteLength" : 4464,
            "byteOffset" : 623632
        },
        {
            "buffer" : 0,
            "byteLength" : 4464,
            "byteOffset" : 628096
        },
        {
            "buffer" : 0,
            "byteLength" : 5952,
            "byteOffset" : 632560
        },
        {
            "buffer" : 0,
            "byteLength" : 2976,
            "byteOffset" : 638512
        },
        {
            "buffer" : 0,
            "byteLength" : 4464,
            "byteOffset" : 641488
        },
        {
            "buffer" : 0,
            "byteLength" : 4464,
            "byteOffset" : 645952
        },
        {
            "buffer" : 0,
            "byteLength" : 5952,
            "byteOffset" : 650416
        },
        {
            "buffer" : 0,
            "byteLength" : 2976,
            "byteOffset" : 656368
        }
    ],
    "buffers" : [
        {
            "byteLength" : 659344,
            "uri" : "sparky.bin"
        }
    ]
}
