[gd_scene load_steps=4 format=2]

[ext_resource path="res://assets/shaders/cel.shader" type="Shader" id=1]
[ext_resource path="res://assets/models/decorations/fruit/tomato/tomato.gltf" type="PackedScene" id=2]

[sub_resource type="ShaderMaterial" id=1]
shader = ExtResource( 1 )
shader_param/use_shadow = false
shader_param/base_color = Color( 0.952941, 0.309804, 0.0588235, 1 )
shader_param/use_specular = false
shader_param/specular_tint = Color( 0.75, 0.75, 0.75, 0.75 )

[node name="tomato" instance=ExtResource( 2 )]

[node name="Fruit" parent="." index="0"]
material/0 = SubResource( 1 )
