[gd_scene load_steps=5 format=2]

[ext_resource path="res://assets/models/decorations/kettle/kettle.gltf" type="PackedScene" id=1]
[ext_resource path="res://assets/shaders/cel.shader" type="Shader" id=2]

[sub_resource type="ShaderMaterial" id=1]
shader = ExtResource( 2 )
shader_param/use_shadow = false
shader_param/base_color = Color( 0, 0, 0, 1 )
shader_param/use_specular = false
shader_param/specular_tint = Color( 0.75, 0.75, 0.75, 0.75 )

[sub_resource type="ShaderMaterial" id=2]
shader = ExtResource( 2 )
shader_param/use_shadow = false
shader_param/base_color = Color( 0.898039, 0.768627, 0.380392, 1 )
shader_param/use_specular = false
shader_param/specular_tint = Color( 0.75, 0.75, 0.75, 0.75 )

[node name="Kettle" instance=ExtResource( 1 )]

[node name="Circle" parent="." index="0"]
material/0 = SubResource( 1 )
material/1 = SubResource( 2 )
