{
    "asset" : {
        "generator" : "Khronos glTF Blender I/O v1.3.48",
        "version" : "2.0"
    },
    "scene" : 0,
    "scenes" : [
        {
            "name" : "Scene",
            "nodes" : [
                0,
                1
            ]
        }
    ],
    "nodes" : [
        {
            "mesh" : 0,
            "name" : "VBLongneck"
        },
        {
            "mesh" : 1,
            "name" : "Inside",
            "translation" : [
                0,
                -0.00578512717038393,
                0
            ]
        }
    ],
    "materials" : [
        {
            "doubleSided" : true,
            "emissiveFactor" : [
                0,
                0,
                0
            ],
            "name" : "BottleGlass",
            "pbrMetallicRoughness" : {
                "baseColorFactor" : [
                    0.07320710271596909,
                    0.028834333643317223,
                    0.005025727674365044,
                    1
                ],
                "metallicFactor" : 0,
                "roughnessFactor" : 0.30000001192092896
            }
        },
        {
            "doubleSided" : true,
            "emissiveFactor" : [
                0,
                0,
                0
            ],
            "name" : "Void",
            "pbrMetallicRoughness" : {
                "baseColorFactor" : [
                    0.002776079112663865,
                    0.005604672711342573,
                    0.0016979426145553589,
                    1
                ],
                "metallicFactor" : 0,
                "roughnessFactor" : 0.800000011920929
            }
        }
    ],
    "meshes" : [
        {
            "name" : "Circle.002",
            "primitives" : [
                {
                    "attributes" : {
                        "POSITION" : 0,
                        "NORMAL" : 1,
                        "TANGENT" : 2,
                        "TEXCOORD_0" : 3
                    },
                    "indices" : 4,
                    "material" : 0
                }
            ]
        },
        {
            "name" : "Circle.003",
            "primitives" : [
                {
                    "attributes" : {
                        "POSITION" : 5,
                        "NORMAL" : 6,
                        "TEXCOORD_0" : 7
                    },
                    "indices" : 8,
                    "material" : 1
                }
            ]
        }
    ],
    "accessors" : [
        {
            "bufferView" : 0,
            "componentType" : 5126,
            "count" : 3337,
            "max" : [
                0.03496236726641655,
                0.35319051146507263,
                0.03496236354112625
            ],
            "min" : [
                -0.03496236354112625,
                0.008201833814382553,
                -0.03496236354112625
            ],
            "type" : "VEC3"
        },
        {
            "bufferView" : 1,
            "componentType" : 5126,
            "count" : 3337,
            "type" : "VEC3"
        },
        {
            "bufferView" : 2,
            "componentType" : 5126,
            "count" : 3337,
            "type" : "VEC4"
        },
        {
            "bufferView" : 3,
            "componentType" : 5126,
            "count" : 3337,
            "type" : "VEC2"
        },
        {
            "bufferView" : 4,
            "componentType" : 5123,
            "count" : 19872,
            "type" : "SCALAR"
        },
        {
            "bufferView" : 5,
            "componentType" : 5126,
            "count" : 12,
            "max" : [
                0.013315984047949314,
                0.3501393496990204,
                0.01331598311662674
            ],
            "min" : [
                -0.013315982185304165,
                0.3501393496990204,
                -0.01331598311662674
            ],
            "type" : "VEC3"
        },
        {
            "bufferView" : 6,
            "componentType" : 5126,
            "count" : 12,
            "type" : "VEC3"
        },
        {
            "bufferView" : 7,
            "componentType" : 5126,
            "count" : 12,
            "type" : "VEC2"
        },
        {
            "bufferView" : 8,
            "componentType" : 5123,
            "count" : 30,
            "type" : "SCALAR"
        }
    ],
    "bufferViews" : [
        {
            "buffer" : 0,
            "byteLength" : 40044,
            "byteOffset" : 0
        },
        {
            "buffer" : 0,
            "byteLength" : 40044,
            "byteOffset" : 40044
        },
        {
            "buffer" : 0,
            "byteLength" : 53392,
            "byteOffset" : 80088
        },
        {
            "buffer" : 0,
            "byteLength" : 26696,
            "byteOffset" : 133480
        },
        {
            "buffer" : 0,
            "byteLength" : 39744,
            "byteOffset" : 160176
        },
        {
            "buffer" : 0,
            "byteLength" : 144,
            "byteOffset" : 199920
        },
        {
            "buffer" : 0,
            "byteLength" : 144,
            "byteOffset" : 200064
        },
        {
            "buffer" : 0,
            "byteLength" : 96,
            "byteOffset" : 200208
        },
        {
            "buffer" : 0,
            "byteLength" : 60,
            "byteOffset" : 200304
        }
    ],
    "buffers" : [
        {
            "byteLength" : 200364,
            "uri" : "VB_Longneck.bin"
        }
    ]
}
