{
    "asset" : {
        "generator" : "Khronos glTF Blender I/O v1.3.48",
        "version" : "2.0"
    },
    "scene" : 0,
    "scenes" : [
        {
            "name" : "Scene",
            "nodes" : [
                0,
                1
            ]
        }
    ],
    "nodes" : [
        {
            "mesh" : 0,
            "name" : "Kennel-col",
            "translation" : [
                0,
                1.4719411134719849,
                0
            ]
        },
        {
            "mesh" : 1,
            "name" : "Text",
            "rotation" : [
                0.7071068286895752,
                0,
                0,
                0.7071068286895752
            ],
            "translation" : [
                2.0738439559936523,
                6.373021125793457,
                3.5536041259765625
            ]
        }
    ],
    "materials" : [
        {
            "doubleSided" : true,
            "emissiveFactor" : [
                0,
                0,
                0
            ],
            "name" : "Body",
            "pbrMetallicRoughness" : {
                "baseColorFactor" : [
                    0.800000011920929,
                    0.800000011920929,
                    0.800000011920929,
                    1
                ],
                "metallicFactor" : 0,
                "roughnessFactor" : 0.5
            }
        },
        {
            "doubleSided" : true,
            "emissiveFactor" : [
                0,
                0,
                0
            ],
            "name" : "Roof",
            "pbrMetallicRoughness" : {
                "baseColorFactor" : [
                    0.2810131907463074,
                    0.011405528523027897,
                    0.009136306121945381,
                    1
                ],
                "metallicFactor" : 0,
                "roughnessFactor" : 0.5
            }
        },
        {
            "doubleSided" : true,
            "emissiveFactor" : [
                0,
                0,
                0
            ],
            "name" : "Material.002",
            "pbrMetallicRoughness" : {
                "baseColorFactor" : [
                    0,
                    0,
                    0,
                    1
                ],
                "metallicFactor" : 0,
                "roughnessFactor" : 0.5
            }
        }
    ],
    "meshes" : [
        {
            "name" : "Plane",
            "primitives" : [
                {
                    "attributes" : {
                        "POSITION" : 0,
                        "NORMAL" : 1,
                        "TANGENT" : 2,
                        "TEXCOORD_0" : 3
                    },
                    "indices" : 4,
                    "material" : 0
                },
                {
                    "attributes" : {
                        "POSITION" : 5,
                        "NORMAL" : 6,
                        "TANGENT" : 7,
                        "TEXCOORD_0" : 8
                    },
                    "indices" : 9,
                    "material" : 1
                }
            ]
        },
        {
            "name" : "Text",
            "primitives" : [
                {
                    "attributes" : {
                        "POSITION" : 10,
                        "NORMAL" : 11,
                        "TEXCOORD_0" : 12
                    },
                    "indices" : 13,
                    "material" : 2
                },
                {
                    "attributes" : {
                        "POSITION" : 14,
                        "NORMAL" : 15,
                        "TEXCOORD_0" : 16
                    },
                    "indices" : 17,
                    "material" : 1
                }
            ]
        }
    ],
    "accessors" : [
        {
            "bufferView" : 0,
            "componentType" : 5126,
            "count" : 265,
            "max" : [
                2.4255318641662598,
                6.723704814910889,
                3.4769556522369385
            ],
            "min" : [
                -2.4255318641662598,
                0,
                -4.019999980926514
            ],
            "type" : "VEC3"
        },
        {
            "bufferView" : 1,
            "componentType" : 5126,
            "count" : 265,
            "type" : "VEC3"
        },
        {
            "bufferView" : 2,
            "componentType" : 5126,
            "count" : 265,
            "type" : "VEC4"
        },
        {
            "bufferView" : 3,
            "componentType" : 5126,
            "count" : 265,
            "type" : "VEC2"
        },
        {
            "bufferView" : 4,
            "componentType" : 5123,
            "count" : 672,
            "type" : "SCALAR"
        },
        {
            "bufferView" : 5,
            "componentType" : 5126,
            "count" : 162,
            "max" : [
                3.799999952316284,
                7.199999809265137,
                3.9019272327423096
            ],
            "min" : [
                -3.799999952316284,
                3.14650821685791,
                -4.21999979019165
            ],
            "type" : "VEC3"
        },
        {
            "bufferView" : 6,
            "componentType" : 5126,
            "count" : 162,
            "type" : "VEC3"
        },
        {
            "bufferView" : 7,
            "componentType" : 5126,
            "count" : 162,
            "type" : "VEC4"
        },
        {
            "bufferView" : 8,
            "componentType" : 5126,
            "count" : 162,
            "type" : "VEC2"
        },
        {
            "bufferView" : 9,
            "componentType" : 5123,
            "count" : 408,
            "type" : "SCALAR"
        },
        {
            "bufferView" : 10,
            "componentType" : 5126,
            "count" : 3314,
            "max" : [
                -0.694603443145752,
                0.2604437470436096,
                0.7328131794929504
            ],
            "min" : [
                -3.6260671615600586,
                0.19415363669395447,
                -0.33910414576530457
            ],
            "type" : "VEC3"
        },
        {
            "bufferView" : 11,
            "componentType" : 5126,
            "count" : 3314,
            "type" : "VEC3"
        },
        {
            "bufferView" : 12,
            "componentType" : 5126,
            "count" : 3314,
            "type" : "VEC2"
        },
        {
            "bufferView" : 13,
            "componentType" : 5123,
            "count" : 9084,
            "type" : "SCALAR"
        },
        {
            "bufferView" : 14,
            "componentType" : 5126,
            "count" : 9617,
            "max" : [
                -0.6902459859848022,
                0.2604437470436096,
                0.7328131794929504
            ],
            "min" : [
                -3.6260671615600586,
                0.09415747970342636,
                -0.34057584404945374
            ],
            "type" : "VEC3"
        },
        {
            "bufferView" : 15,
            "componentType" : 5126,
            "count" : 9617,
            "type" : "VEC3"
        },
        {
            "bufferView" : 16,
            "componentType" : 5126,
            "count" : 9617,
            "type" : "VEC2"
        },
        {
            "bufferView" : 17,
            "componentType" : 5123,
            "count" : 26331,
            "type" : "SCALAR"
        }
    ],
    "bufferViews" : [
        {
            "buffer" : 0,
            "byteLength" : 3180,
            "byteOffset" : 0
        },
        {
            "buffer" : 0,
            "byteLength" : 3180,
            "byteOffset" : 3180
        },
        {
            "buffer" : 0,
            "byteLength" : 4240,
            "byteOffset" : 6360
        },
        {
            "buffer" : 0,
            "byteLength" : 2120,
            "byteOffset" : 10600
        },
        {
            "buffer" : 0,
            "byteLength" : 1344,
            "byteOffset" : 12720
        },
        {
            "buffer" : 0,
            "byteLength" : 1944,
            "byteOffset" : 14064
        },
        {
            "buffer" : 0,
            "byteLength" : 1944,
            "byteOffset" : 16008
        },
        {
            "buffer" : 0,
            "byteLength" : 2592,
            "byteOffset" : 17952
        },
        {
            "buffer" : 0,
            "byteLength" : 1296,
            "byteOffset" : 20544
        },
        {
            "buffer" : 0,
            "byteLength" : 816,
            "byteOffset" : 21840
        },
        {
            "buffer" : 0,
            "byteLength" : 39768,
            "byteOffset" : 22656
        },
        {
            "buffer" : 0,
            "byteLength" : 39768,
            "byteOffset" : 62424
        },
        {
            "buffer" : 0,
            "byteLength" : 26512,
            "byteOffset" : 102192
        },
        {
            "buffer" : 0,
            "byteLength" : 18168,
            "byteOffset" : 128704
        },
        {
            "buffer" : 0,
            "byteLength" : 115404,
            "byteOffset" : 146872
        },
        {
            "buffer" : 0,
            "byteLength" : 115404,
            "byteOffset" : 262276
        },
        {
            "buffer" : 0,
            "byteLength" : 76936,
            "byteOffset" : 377680
        },
        {
            "buffer" : 0,
            "byteLength" : 52662,
            "byteOffset" : 454616
        }
    ],
    "buffers" : [
        {
            "byteLength" : 507280,
            "uri" : "kennel.bin"
        }
    ]
}
