[gd_scene load_steps=3 format=2]

[ext_resource path="res://classes/useables/useable.tscn" type="PackedScene" id=1]
[ext_resource path="res://classes/useables/case.gd" type="Script" id=3]




[node name="Case" instance=ExtResource( 1 )]
script = ExtResource( 3 )
