[gd_scene load_steps=7 format=2]

[ext_resource path="res://classes/useables/useable.tscn" type="PackedScene" id=1]
[ext_resource path="res://assets/shaders/cel.shader" type="Shader" id=2]
[ext_resource path="res://assets/models/props/metal_detector/metal_detector.gltf" type="PackedScene" id=3]

[sub_resource type="ShaderMaterial" id=4]
shader = ExtResource( 2 )
shader_param/use_shadow = false
shader_param/base_color = Color( 0.121569, 0.121569, 0.121569, 1 )
shader_param/use_specular = false
shader_param/specular_tint = Color( 0.75, 0.75, 0.75, 0.75 )

[sub_resource type="ShaderMaterial" id=5]
shader = ExtResource( 2 )
shader_param/use_shadow = false
shader_param/base_color = Color( 0.270588, 0.560784, 0.188235, 1 )
shader_param/use_specular = false
shader_param/specular_tint = Color( 0.75, 0.75, 0.75, 0.75 )

[sub_resource type="CylinderShape" id=3]
radius = 0.0564573
height = 1.29368

[node name="MetalDetector" instance=ExtResource( 1 )]
passage = "TakeMetalDetector"
title = "Take Metal Detector"

[node name="Model" parent="." index="0" instance=ExtResource( 3 )]

[node name="Stick" parent="Model" index="0"]
material/0 = SubResource( 4 )

[node name="Sphere" parent="Model" index="1"]
material/0 = SubResource( 5 )

[node name="CollisionShape" type="CollisionShape" parent="." index="1"]
transform = Transform( 1, 0, 0, 0, 1, 0, 0, 0, 1, 0, 0.525861, 0 )
shape = SubResource( 3 )

[editable path="Model"]
