[gd_scene load_steps=6 format=2]

[ext_resource path="res://assets/models/characters/huntsman/huntsman.gltf" type="PackedScene" id=1]
[ext_resource path="res://assets/shaders/cel.shader" type="Shader" id=2]
[ext_resource path="res://entities/characters/huntsman.gd" type="Script" id=3]

[sub_resource type="ShaderMaterial" id=1]
shader = ExtResource( 2 )
shader_param/use_shadow = false
shader_param/base_color = Color( 0.6, 0.576, 0.54, 1 )
shader_param/use_specular = false
shader_param/specular_tint = Color( 0.75, 0.75, 0.75, 0.75 )

[sub_resource type="SphereShape" id=2]
radius = 0.2

[node name="Huntsman" type="Area"]
script = ExtResource( 3 )
title = "Remove Huntsman"

[node name="Model" parent="." instance=ExtResource( 1 )]

[node name="Body" parent="Model" index="0"]
material/0 = SubResource( 1 )

[node name="CollisionShape" type="CollisionShape" parent="."]
transform = Transform( 1, 0, 0, 0, 0.2, 0, 0, 0, 1, 0, 0.0223583, 0 )
shape = SubResource( 2 )

[editable path="Model"]
