[gd_scene load_steps=7 format=2]

[ext_resource path="res://assets/models/decorations/bed/bed.gltf" type="PackedScene" id=1]
[ext_resource path="res://assets/shaders/cel.shader" type="Shader" id=2]

[sub_resource type="ShaderMaterial" id=1]
shader = ExtResource( 2 )
shader_param/use_shadow = false
shader_param/base_color = Color( 0.572549, 0.517647, 0.462745, 1 )
shader_param/use_specular = false
shader_param/specular_tint = Color( 0.75, 0.75, 0.75, 0.75 )

[sub_resource type="ShaderMaterial" id=2]
shader = ExtResource( 2 )
shader_param/use_shadow = false
shader_param/base_color = Color( 0.266667, 0.419608, 0.678431, 1 )
shader_param/use_specular = false
shader_param/specular_tint = Color( 0.75, 0.75, 0.75, 0.75 )

[sub_resource type="ShaderMaterial" id=3]
shader = ExtResource( 2 )
shader_param/use_shadow = false
shader_param/base_color = Color( 1, 1, 1, 1 )
shader_param/use_specular = false
shader_param/specular_tint = Color( 0.75, 0.75, 0.75, 0.75 )

[sub_resource type="ShaderMaterial" id=4]
shader = ExtResource( 2 )
shader_param/use_shadow = false
shader_param/base_color = Color( 0.952941, 0.866667, 0.968627, 1 )
shader_param/use_specular = false
shader_param/specular_tint = Color( 0.75, 0.75, 0.75, 0.75 )

[node name="Bed" instance=ExtResource( 1 )]

[node name="Frame" parent="." index="0"]
material/0 = SubResource( 1 )

[node name="Mattress" parent="." index="1"]
material/0 = SubResource( 2 )
material/1 = SubResource( 3 )

[node name="Pillows" parent="." index="2"]
material/0 = SubResource( 4 )
