[gd_scene load_steps=2 format=2]

[ext_resource path="res://classes/useables/useable.gd" type="Script" id=1]

[node name="Useable" type="Area"]
collision_layer = 512
collision_mask = 512
script = ExtResource( 1 )
