[gd_scene load_steps=8 format=2]

[ext_resource path="res://assets/models/props/vent_grate/vent_grate.gltf" type="PackedScene" id=1]
[ext_resource path="res://classes/useables/useable.tscn" type="PackedScene" id=2]
[ext_resource path="res://assets/shaders/cel.shader" type="Shader" id=3]
[ext_resource path="res://props/vent_grate.gd" type="Script" id=4]

[sub_resource type="ShaderMaterial" id=1]
shader = ExtResource( 3 )
shader_param/use_shadow = false
shader_param/base_color = Color( 0.419608, 0.419608, 0.419608, 1 )
shader_param/use_specular = false
shader_param/specular_tint = Color( 0.75, 0.75, 0.75, 0.75 )

[sub_resource type="ShaderMaterial" id=2]
shader = ExtResource( 3 )
shader_param/use_shadow = false
shader_param/base_color = Color( 0.768627, 0.768627, 0.768627, 1 )
shader_param/use_specular = false
shader_param/specular_tint = Color( 0.75, 0.75, 0.75, 0.75 )

[sub_resource type="BoxShape" id=3]
extents = Vector3( 0.02, 0.47, 0.53 )

[node name="VentGrate" instance=ExtResource( 2 )]
script = ExtResource( 4 )

[node name="Model" parent="." index="0" instance=ExtResource( 1 )]

[node name="Vent" parent="Model" index="0"]
material/0 = SubResource( 1 )
material/1 = SubResource( 2 )

[node name="CollisionShape" type="CollisionShape" parent="." index="1"]
transform = Transform( 1, 0, 0, 0, 1, 0, 0, 0, 1, -0.005, 0.445, 0 )
shape = SubResource( 3 )

[editable path="Model"]
