{
	"info": {
		"_postman_id": "36916878-386e-4b1b-84d3-4c8f328dcd7a",
		"name": "SPL API",
		"schema": "https://schema.getpostman.com/json/collection/v2.1.0/collection.json",
		"_exporter_id": "27543333"
	},
	"item": [
		{
			"name": "READ",
			"item": [
				{
					"name": "Read About",
					"request": {
						"method": "GET",
						"header": [],
						"url": {
							"raw": "http://localhost/ShillongPremiereLeague/read/R_About.php",
							"protocol": "http",
							"host": [
								"localhost"
							],
							"path": [
								"ShillongPremiereLeague",
								"read",
								"R_About.php"
							]
						}
					},
					"response": []
				},
				{
					"name": "Read AllTeam",
					"request": {
						"method": "GET",
						"header": [],
						"url": {
							"raw": "http://localhost/ShillongPremiereLeague/read/R_AllTeam.php",
							"protocol": "http",
							"host": [
								"localhost"
							],
							"path": [
								"ShillongPremiereLeague",
								"read",
								"R_AllTeam.php"
							]
						}
					},
					"response": []
				},
				{
					"name": "Read DeleteTeam",
					"request": {
						"method": "GET",
						"header": [],
						"url": {
							"raw": "http://localhost/ShillongPremiereLeague/read/R_DeleteAllTeam.php",
							"protocol": "http",
							"host": [
								"localhost"
							],
							"path": [
								"ShillongPremiereLeague",
								"read",
								"R_DeleteAllTeam.php"
							]
						}
					},
					"response": []
				},
				{
					"name": "Read Gallery",
					"request": {
						"method": "GET",
						"header": [],
						"url": {
							"raw": "http://localhost/ShillongPremiereLeague/read/R_Gallery.php",
							"protocol": "http",
							"host": [
								"localhost"
							],
							"path": [
								"ShillongPremiereLeague",
								"read",
								"R_Gallery.php"
							]
						}
					},
					"response": []
				},
				{
					"name": "Read Point",
					"request": {
						"method": "GET",
						"header": [],
						"url": {
							"raw": "http://localhost/ShillongPremiereLeague/read/R_Point.php",
							"protocol": "http",
							"host": [
								"localhost"
							],
							"path": [
								"ShillongPremiereLeague",
								"read",
								"R_Point.php"
							]
						}
					},
					"response": []
				},
				{
					"name": "Read Point Update",
					"request": {
						"method": "GET",
						"header": [],
						"url": {
							"raw": "http://localhost/ShillongPremiereLeague/read/R_PointUpdate.php",
							"protocol": "http",
							"host": [
								"localhost"
							],
							"path": [
								"ShillongPremiereLeague",
								"read",
								"R_PointUpdate.php"
							]
						}
					},
					"response": []
				},
				{
					"name": "Read Team not in Point",
					"request": {
						"method": "GET",
						"header": [],
						"url": {
							"raw": "http://localhost/ShillongPremiereLeague/read/R_TeamNotInPoint.php",
							"protocol": "http",
							"host": [
								"localhost"
							],
							"path": [
								"ShillongPremiereLeague",
								"read",
								"R_TeamNotInPoint.php"
							]
						}
					},
					"response": []
				},
				{
					"name": "Read Venue",
					"request": {
						"method": "GET",
						"header": [],
						"url": {
							"raw": "http://localhost/ShillongPremiereLeague/read/R_Venue.php",
							"protocol": "http",
							"host": [
								"localhost"
							],
							"path": [
								"ShillongPremiereLeague",
								"read",
								"R_Venue.php"
							]
						}
					},
					"response": []
				}
			]
		},
		{
			"name": "CREATE",
			"item": [
				{
					"name": "Create AllTeam",
					"request": {
						"method": "POST",
						"header": [],
						"url": {
							"raw": "http://localhost/ShillongPremiereLeague/create/C_AllTeam.php",
							"protocol": "http",
							"host": [
								"localhost"
							],
							"path": [
								"ShillongPremiereLeague",
								"create",
								"C_AllTeam.php"
							]
						}
					},
					"response": []
				},
				{
					"name": "Create Galery",
					"request": {
						"method": "POST",
						"header": [],
						"url": {
							"raw": "http://localhost/ShillongPremiereLeague/create/C_Gallery.php",
							"protocol": "http",
							"host": [
								"localhost"
							],
							"path": [
								"ShillongPremiereLeague",
								"create",
								"C_Gallery.php"
							]
						}
					},
					"response": []
				},
				{
					"name": "Create GamePlay",
					"request": {
						"method": "POST",
						"header": [],
						"url": {
							"raw": "http://localhost/ShillongPremiereLeague/create/C_GamePlay.php",
							"protocol": "http",
							"host": [
								"localhost"
							],
							"path": [
								"ShillongPremiereLeague",
								"create",
								"C_GamePlay.php"
							]
						}
					},
					"response": []
				},
				{
					"name": "Create Point",
					"request": {
						"method": "POST",
						"header": [],
						"url": {
							"raw": "http://localhost/ShillongPremiereLeague/create/C_Point.php",
							"protocol": "http",
							"host": [
								"localhost"
							],
							"path": [
								"ShillongPremiereLeague",
								"create",
								"C_Point.php"
							]
						}
					},
					"response": []
				},
				{
					"name": "Create User",
					"request": {
						"method": "POST",
						"header": [],
						"url": {
							"raw": "http://localhost/ShillongPremiereLeague/create/C_User.php",
							"protocol": "http",
							"host": [
								"localhost"
							],
							"path": [
								"ShillongPremiereLeague",
								"create",
								"C_User.php"
							]
						}
					},
					"response": []
				},
				{
					"name": "Create Venue",
					"request": {
						"method": "POST",
						"header": [],
						"url": {
							"raw": "http://localhost/ShillongPremiereLeague/create/C_Venue.php",
							"protocol": "http",
							"host": [
								"localhost"
							],
							"path": [
								"ShillongPremiereLeague",
								"create",
								"C_Venue.php"
							]
						}
					},
					"response": []
				}
			]
		},
		{
			"name": "DELETE",
			"item": [
				{
					"name": "Delete AllTeam",
					"request": {
						"method": "DELETE",
						"header": [],
						"url": {
							"raw": "http://localhost/ShillongPremiereLeague/delete/D_AllTeam.php",
							"protocol": "http",
							"host": [
								"localhost"
							],
							"path": [
								"ShillongPremiereLeague",
								"delete",
								"D_AllTeam.php"
							]
						}
					},
					"response": []
				},
				{
					"name": "Delete Gallery",
					"request": {
						"method": "DELETE",
						"header": [],
						"url": {
							"raw": "http://localhost/ShillongPremiereLeague/delete/D_Gallery.php",
							"protocol": "http",
							"host": [
								"localhost"
							],
							"path": [
								"ShillongPremiereLeague",
								"delete",
								"D_Gallery.php"
							]
						}
					},
					"response": []
				},
				{
					"name": "Delete Venue",
					"request": {
						"method": "DELETE",
						"header": [],
						"url": {
							"raw": "http://localhost/ShillongPremiereLeague/delete/D_Venue.php",
							"protocol": "http",
							"host": [
								"localhost"
							],
							"path": [
								"ShillongPremiereLeague",
								"delete",
								"D_Venue.php"
							]
						}
					},
					"response": []
				}
			]
		},
		{
			"name": "UPDATE",
			"item": [
				{
					"name": "Update AllTeam",
					"request": {
						"method": "PUT",
						"header": [],
						"url": {
							"raw": "http://localhost/ShillongPremiereLeague/update/U_AllTeam.php",
							"protocol": "http",
							"host": [
								"localhost"
							],
							"path": [
								"ShillongPremiereLeague",
								"update",
								"U_AllTeam.php"
							]
						}
					},
					"response": []
				},
				{
					"name": "Update Point",
					"request": {
						"method": "PUT",
						"header": [],
						"url": {
							"raw": "http://localhost/ShillongPremiereLeague/update/U_Point.php",
							"protocol": "http",
							"host": [
								"localhost"
							],
							"path": [
								"ShillongPremiereLeague",
								"update",
								"U_Point.php"
							]
						}
					},
					"response": []
				},
				{
					"name": "Update Venue",
					"request": {
						"method": "PUT",
						"header": [],
						"url": {
							"raw": "http://localhost/ShillongPremiereLeague/update/U_Venue.php",
							"protocol": "http",
							"host": [
								"localhost"
							],
							"path": [
								"ShillongPremiereLeague",
								"update",
								"U_Venue.php"
							]
						}
					},
					"response": []
				}
			]
		}
	]
}