<svg width="55" height="54" viewBox="0 0 55 54" xmlns="http://www.w3.org/2000/svg">
    <rect x="0.875" width="54" height="54" fill="#D50000"/>
    <path d="M28.258 10.125C37.7899 10.125 45.5161 17.8523 45.5161 27.3831C45.5161 36.915 37.7899 44.6411 28.258 44.6411C18.7261 44.6411 11 36.9149 11 27.3831C11 17.8523 18.7262 10.125 28.258 10.125Z" fill="white"/>
    <path d="M23.9338 21.2727C25.8248 21.2727 27.5353 22.243 28.5156 23.58L30.8391 21.2399C29.4495 19.4329 26.7749 18 23.9338 18C18.9593 18 14.8793 22.0255 14.8793 27C14.8793 31.9745 18.9593 36 23.9338 36C28.0575 36 31.5265 33.2346 32.5901 29.4545C32.8192 28.669 32.9338 27.8508 32.9338 27V26.1818H24.752V29.4539H29.0884C28.1884 31.3849 26.2083 32.7273 23.9338 32.7273C20.7757 32.7273 18.152 30.1581 18.152 27C18.152 23.8419 20.7757 21.2727 23.9338 21.2727Z" fill="#D50000"/>
    <path d="M40.2988 22.9092H37.0261V25.3638H34.5715V28.6365H37.0261V31.0911H40.2988V28.6365H42.8079V25.3638H40.2988V22.9092Z" fill="#D50000"/>
</svg>
