<svg version="1.1" id="Capa_1" xmlns="http://www.w3.org/2000/svg" xmlns:xlink="http://www.w3.org/1999/xlink" x="0px" y="0px"
	 viewBox="0 0 512 512" style="enable-background:new 0 0 512 512;" xml:space="preserve">
<g>
	<g>
		<path d="M136,241h-30c-8.284,0-15,6.716-15,15c0,5.273,0,114.737,0,120c0,8.284,6.716,15,15,15s15-6.716,15-15v-45h15
			c24.813,0,45-20.187,45-45S160.813,241,136,241z M136,301h-15v-30h15c8.271,0,15,6.729,15,15S144.271,301,136,301z"/>
	</g>
</g>
<g>
	<g>
		<path d="M256,301c-8.271,0-15-6.729-15-15s6.729-15,15-15s15,6.729,15,15c0,8.284,6.716,15,15,15s15-6.716,15-15
			c0-24.813-20.187-45-45-45s-45,20.187-45,45s20.187,45,45,45c8.271,0,15,6.729,15,15s-6.729,15-15,15s-15-6.729-15-15
			c0-8.284-6.716-15-15-15s-15,6.716-15,15c0,24.813,20.187,45,45,45s45-20.187,45-45S280.813,301,256,301z"/>
	</g>
</g>
<g>
	<g>
		<path d="M376,241h-30c-8.284,0-15,6.716-15,15v120c0,8.284,6.716,15,15,15h30c24.813,0,45-20.187,45-45v-60
			C421,261.187,400.813,241,376,241z M391,346c0,8.271-6.729,15-15,15h-15v-90h15c8.271,0,15,6.729,15,15V346z"/>
	</g>
</g>
<g>
	<g>
		<path d="M466,181h-15v-76c0-0.076-0.01-0.149-0.011-0.225c-0.062-4.049-1.738-7.732-4.371-10.369
			c-0.005-0.005-0.009-0.01-0.014-0.015L356.609,4.396c-0.005-0.004-0.01-0.009-0.015-0.014c-2.658-2.657-6.348-4.303-10.359-4.371
			C346.156,0.011,346.08,0,346,0H76c-8.284,0-15,6.716-15,15v166H46c-8.284,0-15,6.716-15,15v240c0,8.284,6.716,15,15,15h15v46
			c0,8.284,6.716,15,15,15h360c8.284,0,15-6.716,15-15v-46h15c8.284,0,15-6.716,15-15V196C481,187.716,474.284,181,466,181z
			 M361,51.213L399.787,90H361V51.213z M91,30h240v75c0,8.284,6.716,15,15,15h75v61H91V30z M421,482H91v-31h330V482z M451,421H61
			V211h390V421z"/>
	</g>
</g>
</svg>
