<svg version="1.1" id="Capa_1" xmlns="http://www.w3.org/2000/svg" xmlns:xlink="http://www.w3.org/1999/xlink" x="0px"
     y="0px"
     viewBox="0 0 448 448" style="enable-background:new 0 0 448 448;" xml:space="preserve">
<g>
	<g>
		<circle cx="64" cy="384" r="64"/>
	</g>
</g>
    <g>
	<g>
		<path d="M0,149.344v85.344c117.632,0,213.344,95.68,213.344,213.312h85.312C298.656,283.328,164.672,149.344,0,149.344z"/>
	</g>
</g>
    <g>
	<g>
		<path d="M0,0v85.344C200,85.344,362.688,248,362.688,448H448C448,200.96,247.04,0,0,0z"/>
	</g>
</g>
</svg>
