{
  "name": "{{spelllore}}",
  "content": "<table class=\"spelllisttable\"> <tbody> <tr class=\"tableheaderrow\"> <td class=\"weave\">Weave</td> <td class=\"spell\">Spell</td> <td class=\"range\">Range</td> <td class=\"areaofeffect\">Area of Effect</td> <td class=\"duration\">Duration</td> <td class=\"save\">Save</td> </tr> <tr class=\"tablerow open-journal\" data-table=\"{{spell}}\"> <td class=\"weave\">1st</td> <td class=\"spell\">{{spell}}</td> <td class=\"range\">{{range}}</td> <td class=\"areaofeffect\">{{aoe}}</td> <td class=\"duration\">{{duration}}</td> <td class=\"save\">{{save}}</td> </tr> <tr class=\"tablerow open-journal\" data-table=\"{{spell-2}}\"> <td class=\"weave\">2nd</td> <td class=\"spell\">{{spell-2}}</td> <td class=\"range\">{{range-2}}</td> <td class=\"areaofeffect\">{{aoe-2}}</td> <td class=\"duration\">{{duration-2}}</td> <td class=\"save\">{{save-2}}</td> </tr> <tr class=\"tablerow open-journal\" data-table=\"{{spell-3}}\"> <td class=\"weave\">3rd</td> <td class=\"spell\">{{spell-3}}</td> <td class=\"range\">{{range-3}}</td> <td class=\"areaofeffect\">{{aoe-3}}</td> <td class=\"duration\">{{duration-3}}</td> <td class=\"save\">{{save-3}}</td> </tr> <tr class=\"tablerow open-journal\" data-table=\"{{spell-4}}\"> <td class=\"weave\">4th</td> <td class=\"spell\">{{spell-4}}</td> <td class=\"range\">{{range-4}}</td> <td class=\"areaofeffect\">{{aoe-4}}</td> <td class=\"duration\">{{duration-4}}</td> <td class=\"save\">{{save-4}}</td> </tr> <tr class=\"tablerow open-journal\" data-table=\"{{spell-5}}\"> <td class=\"weave\">5th</td> <td class=\"spell\">{{spell-5}}</td> <td class=\"range\">{{range-5}}</td> <td class=\"areaofeffect\">{{aoe-5}}</td> <td class=\"duration\">{{duration-5}}</td> <td class=\"save\">{{save-5}}</td> </tr> <tr class=\"tablerow open-journal\" data-table=\"{{spell-6}}\"> <td class=\"weave\">6th</td> <td class=\"spell\">{{spell-6}}</td> <td class=\"range\">{{range-6}}</td> <td class=\"areaofeffect\">{{aoe-6}}</td> <td class=\"duration\">{{duration-6}}</td> <td class=\"save\">{{save-6}}</td> </tr> <tr class=\"tablerow open-journal\" data-table=\"{{spell-7}}\"> <td class=\"weave\">7th</td> <td class=\"spell\">{{spell-7}}</td> <td class=\"range\">{{range-7}}</td> <td class=\"areaofeffect\">{{aoe-7}}</td> <td class=\"duration\">{{duration-7}}</td> <td class=\"save\">{{save-7}}</td> </tr> <tr class=\"tablerow open-journal\" data-table=\"{{spell-8}}\"> <td class=\"weave\">8th</td> <td class=\"spell\">{{spell-8}}</td> <td class=\"range\">{{range-8}}</td> <td class=\"areaofeffect\">{{aoe-8}}</td> <td class=\"duration\">{{duration-8}}</td> <td class=\"save\">{{save-8}}</td> </tr> <tr class=\"tablerow open-journal\" data-table=\"{{spell-9}}\"> <td class=\"weave\">9th</td> <td class=\"spell\">{{spell-9}}</td> <td class=\"range\">{{range-9}}</td> <td class=\"areaofeffect\">{{aoe-9}}</td> <td class=\"duration\">{{duration-9}}</td> <td class=\"save\">{{save-9}}</td> </tr> <tr class=\"tablerow open-journal\" data-table=\"{{spell-10}}\"> <td class=\"weave\">10th</td> <td class=\"spell\">{{spell-10}}</td> <td class=\"range\">{{range-10}}</td> <td class=\"areaofeffect\">{{aoe-10}}</td> <td class=\"duration\">{{duration-10}}</td> <td class=\"save\">{{save-10}}</td> </tr> <tr class=\"tablefootrow\"> <td class=\"stat\" colspan=\"6\">Vocations: {{vocations}}</td> </tr> <tr class=\"tablefootrow\"> <td class=\"stat\" colspan=\"4\">Stat Value: {{lorestat}}</td> <td class=\"page\" colspan=\"2\">Page: {{pagenum}}</td> </tr> </tbody> </table>",
  "type": "journal"
}