{
  "id": "hnh",
  "title": "Heroes & Hardships",
  "description": "The official implementation of the Heroes & Hardships Universal RPG System, by Earl of Fife Games LLC, for Foundry VTT.",
  "version": "0.03",
  "compatibility": {
    "minimum": "10",
    "verified": "10",
    "maximum": "10"
  },
  "authors": [
    {
      "name": "James Huddleston",
      "flags": {}
    }
  ],
  "esmodules": [
    "hnh.js",
    "module/config.js",
    "module/hooks/activeEffectHooks.js",
    "module/hooks/actorHooks.js",
    "module/hooks/canvasHooks.js",
    "module/hooks/chatHooks.js",
    "module/hooks/itemHooks.js",
    "module/hooks/journalHooks.js",
    "module/hooks/dialogHooks.js",
    "module/migrations.js",
    "module/token.js",
    "module/utility.js"
  ],
  "styles": [
    "hnh.css"
  ],
  "packs": [
    {
      "name": "hnh-macros",
      "label": "Macros for H&H",
      "system": "hnh",
      "path": "packs/hnh-macros.db",
      "type": "Macro",
      "private": false,
      "flags": {}
    },
    {
      "name": "skills",
      "label": "Core Skills",
      "system": "hnh",
      "path": "packs/skills.db",
      "type": "Item",
      "private": false,
      "flags": {}
    }
  ],
  "languages": [
    {
      "lang": "en",
      "name": "English",
      "path": "lang/en.json",
      "flags": {}
    }
  ],
  "gridDistance": 5,
  "gridUnits": "ft",
  "attributeTokenAttribute": "tracked.hp",
  "url": "https://gitlab.com/jbhuddleston/hnh",
  "manifest": "https://gitlab.com/jbhuddleston/hnh/-/raw/main/system.json",
  "download": "https://gitlab.com/jbhuddleston/hnh/-/archive/main/hnh.zip",
  "license": "LICENSE.txt"
}