[gd_resource type="StyleBoxFlat" format=3 uid="uid://b3kndxxai3se"]

[resource]
content_margin_left = 12.0
content_margin_top = 12.0
content_margin_right = 12.0
content_margin_bottom = 12.0
bg_color = Color(0.858824, 0.854902, 0.678431, 1)
border_width_left = 1
border_width_top = 1
border_width_right = 1
border_width_bottom = 1
border_color = Color(0.764706, 0.772549, 0.6, 1)
corner_radius_top_left = 42
corner_radius_top_right = 42
corner_radius_bottom_right = 42
corner_radius_bottom_left = 42
shadow_color = Color(0.231373, 0.231373, 0.231373, 0.556863)
shadow_size = 4
shadow_offset = Vector2(3, 6)
