[gd_resource type="Theme" load_steps=3 format=3 uid="uid://djytabic1c7tf"]

[ext_resource type="StyleBox" uid="uid://bxpohx85b3mcs" path="res://TextEditSuper/assets/normal_style.tres" id="1_dxujf"]
[ext_resource type="StyleBox" uid="uid://c35oor2mrwyhh" path="res://TextEditSuper/assets/focus_style.tres" id="1_ssdv2"]

[resource]
resource_local_to_scene = true
TextEdit/colors/background_color = Color(0.317647, 0.317647, 0.317647, 0)
TextEdit/colors/font_color = Color(0.87451, 0.87451, 0.87451, 1)
TextEdit/colors/font_placeholder_color = Color(0.875, 0.875, 0.875, 0.6)
TextEdit/constants/caret_width = 3
TextEdit/font_sizes/font_size = 14
TextEdit/styles/focus = ExtResource("1_ssdv2")
TextEdit/styles/normal = ExtResource("1_dxujf")
