<svg width="86" height="84" viewBox="0 0 86 84" fill="none" xmlns="http://www.w3.org/2000/svg">
<path opacity="0.15" fill-rule="evenodd" clip-rule="evenodd" d="M59.6958 20.4439C65.6906 24.7544 73.3568 27.5965 75.6399 34.5635C77.9914 41.739 75.0418 49.287 71.2655 55.7487C67.5127 62.1703 62.1189 67.4353 55.0252 69.8382C47.3579 72.4352 39.0406 72.4474 31.5446 69.2031C23.0224 65.5146 14.78 59.8462 11.7844 51.1231C8.65352 42.0063 11.0921 32.0366 15.9583 23.8171C20.7705 15.6889 28.2062 8.03722 37.7274 7.30291C46.5258 6.62435 52.4949 15.2662 59.6958 20.4439Z" fill="url(#paint0_linear_654_10283)"/>
<path d="M50.2271 35.9264C49.5244 35.2237 49.5244 34.084 50.2271 33.3808C50.9302 32.6782 52.07 32.6782 52.7727 33.3808L59.9727 40.5809C60.6758 41.2839 60.6758 42.4237 59.9727 43.1264L52.7727 50.3264C52.07 51.0295 50.9302 51.0295 50.2271 50.3264C49.5244 49.6233 49.5244 48.484 50.2271 47.7809L56.1545 41.8539L50.2271 35.9264ZM28.8455 41.8538L34.7725 47.7808C35.4756 48.4838 35.4756 49.6232 34.7725 50.3263C34.0698 51.0294 32.93 51.0294 32.2269 50.3263L25.0273 43.1263C24.3242 42.4236 24.3242 41.2839 25.0273 40.5807L32.2269 33.3807C32.93 32.6781 34.0698 32.6781 34.7725 33.3807C35.4756 34.0838 35.4756 35.2236 34.7725 35.9263L28.8455 41.8538ZM43.5148 34.0216C43.864 33.091 44.9014 32.6192 45.8324 32.9684C46.7631 33.3172 47.2348 34.355 46.8856 35.2856L41.4858 49.6861C41.1366 50.6167 40.0992 51.0884 39.1682 50.7396C38.2376 50.3904 37.7659 49.3527 38.1151 48.422L43.5148 34.0216Z" fill="url(#paint1_linear_654_10283)"/>
<defs>
<linearGradient id="paint0_linear_654_10283" x1="-6.43669" y1="62.6008" x2="76.0862" y2="87.858" gradientUnits="userSpaceOnUse">
<stop stop-color="#0066FF"/>
<stop offset="1" stop-color="#2CE0C5"/>
</linearGradient>
<linearGradient id="paint1_linear_654_10283" x1="24.5" y1="54.7548" x2="66.6654" y2="36.6702" gradientUnits="userSpaceOnUse">
<stop stop-color="#0066FF"/>
<stop offset="1" stop-color="#2CE0C5"/>
</linearGradient>
</defs>
</svg>
