<svg width="85" height="85" viewBox="0 0 85 85" fill="none" xmlns="http://www.w3.org/2000/svg">
<path opacity="0.15" fill-rule="evenodd" clip-rule="evenodd" d="M17.4478 52.5185C14.4114 45.7881 9.19327 39.4937 10.6995 32.3185C12.2508 24.9286 18.5792 19.8666 25.0804 16.1587C31.5412 12.4739 38.845 10.6112 46.1897 12.0771C54.1283 13.6616 61.3374 17.8097 66.207 24.3674C71.7431 31.8228 76.0471 40.853 74.2798 49.9053C72.4328 59.366 65.3361 66.7808 57.0121 71.466C48.7805 76.0991 38.5152 79.0078 29.9024 74.8831C21.9435 71.0716 21.095 60.603 17.4478 52.5185Z" fill="url(#paint0_linear_604_264)"/>
<path d="M31.34 55.6788C28.196 55.6788 25.724 54.4908 23.924 52.1148C22.148 49.6908 21.26 46.5108 21.26 42.5748C21.26 38.6388 22.148 35.4708 23.924 33.0708C25.724 30.6708 28.196 29.4708 31.34 29.4708C34.532 29.4708 37.004 30.6708 38.756 33.0708C40.532 35.4708 41.42 38.6388 41.42 42.5748C41.42 46.5108 40.532 49.6908 38.756 52.1148C37.004 54.4908 34.532 55.6788 31.34 55.6788ZM36.488 42.5748C36.488 39.8868 36.044 37.8348 35.156 36.4188C34.292 35.0028 33.02 34.2948 31.34 34.2948C29.66 34.2948 28.388 35.0028 27.524 36.4188C26.66 37.8348 26.228 39.8868 26.228 42.5748C26.228 45.2628 26.66 47.3148 27.524 48.7308C28.388 50.1228 29.66 50.8188 31.34 50.8188C33.02 50.8188 34.292 50.1108 35.156 48.6948C36.044 47.2788 36.488 45.2388 36.488 42.5748ZM60.3518 46.2828H63.0518V50.8908H60.3518V55.1748H55.3478V50.8908H43.4318V46.2828L51.8198 29.9748H57.1478L48.7958 46.2828H55.3478V40.3068H60.3518V46.2828Z" fill="url(#paint1_linear_604_264)"/>
<defs>
<linearGradient id="paint0_linear_604_264" x1="95.7986" y1="49.0758" x2="36.9603" y2="-14.059" gradientUnits="userSpaceOnUse">
<stop stop-color="#0066FF"/>
<stop offset="1" stop-color="#2CE0C5"/>
</linearGradient>
<linearGradient id="paint1_linear_604_264" x1="20" y1="93.7415" x2="116.576" y2="66.9585" gradientUnits="userSpaceOnUse">
<stop stop-color="#0066FF"/>
<stop offset="1" stop-color="#2CE0C5"/>
</linearGradient>
</defs>
</svg>
