<?xml version="1.0" encoding="UTF-8"?>
<svg width="16px" height="16px" viewBox="0 0 16 16" version="1.1" xmlns="http://www.w3.org/2000/svg" xmlns:xlink="http://www.w3.org/1999/xlink">
    <!-- Generator: Sketch 52.2 (67145) - http://www.bohemiancoding.com/sketch -->
    <title>completed_tick</title>
    <desc>Created with Sketch.</desc>
    <g id="21-st-Nov" stroke="none" stroke-width="1" fill="none" fill-rule="evenodd">
        <g id="Jupiter_On-boarding_05_identity_individual_1" transform="translate(-1282.000000, -449.000000)">
            <g id="input-01" transform="translate(643.000000, 408.000000)">
                <g id="completed_tick" transform="translate(639.000000, 41.000000)">
                    <circle id="Oval" fill="#7ED321" cx="8" cy="8" r="8"></circle>
                    <path d="M11.7042549,4.07848979 C11.4219783,3.91708362 11.0623152,4.01215849 10.897961,4.29443504 L7.12960581,10.8265946 L5.01953328,8.88087631 C4.79474386,8.6413466 4.42328855,8.63029138 4.18744391,8.85139573 C3.94865121,9.07618516 3.93685898,9.44764047 4.15870034,9.68643317 L6.85322538,12.1738571 C7.0780148,12.4104388 7.44947011,12.421494 7.68826281,12.1996526 C7.76049023,12.1340583 11.9202001,4.88478366 11.9202001,4.88478366 C12.0845543,4.60250711 11.9865314,4.24284403 11.7042549,4.07848979 Z" id="Path" fill="#FFFFFF"></path>
                </g>
            </g>
        </g>
    </g>
</svg>