<?xml version="1.0" encoding="UTF-8" standalone="no"?>
<!DOCTYPE svg PUBLIC "-//W3C//DTD SVG 1.1//EN" "http://www.w3.org/Graphics/SVG/1.1/DTD/svg11.dtd">
<svg xmlns="http://www.w3.org/2000/svg" xmlns:xl="http://www.w3.org/1999/xlink" version="1.1" xmlns:dc="http://purl.org/dc/elements/1.1/" viewBox="268 99 1302 916" width="1302" height="916">
  <defs>
    <font-face font-family="Helvetica Neue" font-size="24" panose-1="2 0 8 6 0 0 0 2 0 4" units-per-em="1000" underline-position="-100" underline-thickness="50" slope="0" x-height="545" cap-height="721" ascent="960.9985" descent="-220.99304" font-weight="700">
      <font-face-src>
        <font-face-name name="HelveticaNeue-CondensedBold"/>
      </font-face-src>
    </font-face>
    <font-face font-family="Helvetica Neue" font-size="16" panose-1="2 0 8 3 0 0 0 9 0 4" units-per-em="1000" underline-position="-100" underline-thickness="50" slope="0" x-height="517" cap-height="714" ascent="975.0061" descent="-216.99524" font-weight="700">
      <font-face-src>
        <font-face-name name="HelveticaNeue-Bold"/>
      </font-face-src>
    </font-face>
    <font-face font-family="Helvetica Neue" font-size="16" panose-1="2 0 5 3 0 0 0 9 0 4" units-per-em="1000" underline-position="-100" underline-thickness="50" slope="-750" x-height="517" cap-height="714" ascent="957.0007" descent="-212.99744" font-style="italic" font-weight="400">
      <font-face-src>
        <font-face-name name="HelveticaNeue-Italic"/>
      </font-face-src>
    </font-face>
    <marker orient="auto" overflow="visible" markerUnits="strokeWidth" id="FilledArrow_Marker" stroke-linejoin="miter" stroke-miterlimit="10" viewBox="-1 -4 10 8" markerWidth="10" markerHeight="8" color="black">
      <g>
        <path d="M 8 0 L 0 -3 L 0 3 Z" fill="currentColor" stroke="currentColor" stroke-width="1"/>
      </g>
    </marker>
    <marker orient="auto" overflow="visible" markerUnits="strokeWidth" id="FilledArrow_Marker_2" stroke-linejoin="miter" stroke-miterlimit="10" viewBox="-9 -4 10 8" markerWidth="10" markerHeight="8" color="black">
      <g>
        <path d="M -8 0 L 0 3 L 0 -3 Z" fill="currentColor" stroke="currentColor" stroke-width="1"/>
      </g>
    </marker>
    <font-face font-family="Helvetica Neue" font-size="16" panose-1="2 0 5 3 0 0 0 2 0 4" units-per-em="1000" underline-position="-100" underline-thickness="50" slope="0" x-height="517" cap-height="714" ascent="951.9958" descent="-212.99744" font-weight="400">
      <font-face-src>
        <font-face-name name="HelveticaNeue"/>
      </font-face-src>
    </font-face>
  </defs>
  <metadata> Produced by OmniGraffle 7.18.4\n2022-12-22 05:04:04 +0000</metadata>
  <g id="Rails" stroke-dasharray="none" fill-opacity="1" stroke-opacity="1" stroke="none" fill="none">
    <title>Rails</title>
    <rect fill="white" x="268" y="99" width="1302" height="916"/>
    <g id="Rails_Layer_1">
      <title>Layer 1</title>
      <g id="Graphic_9">
        <rect x="681" y="288" width="355.5" height="726.5" fill="#c0ffc0" fill-opacity=".5078404"/>
        <path d="M 681 288 L 1036.5 288 L 1036.5 1014.5 L 681 1014.5 Z" stroke="gray" stroke-linecap="round" stroke-linejoin="round" stroke-dasharray="4.0,4.0" stroke-width="1"/>
        <text transform="translate(686 293)" fill="black" fill-opacity=".5">
          <tspan font-family="Helvetica Neue" font-size="24" font-weight="700" fill="black" fill-opacity=".5" x="0" y="23">Everum’s services</tspan>
        </text>
      </g>
      <g id="Graphic_2">
        <rect x="722.5" y="532" width="272.5" height="112.5" fill="#c0c0ff"/>
        <path d="M 722.5 532 L 995 532 L 995 644.5 L 722.5 644.5 Z" stroke="gray" stroke-linecap="round" stroke-linejoin="round" stroke-dasharray="4.0,4.0" stroke-width="1"/>
        <text transform="translate(727.5 569.29395)" fill="black">
          <tspan font-family="Helvetica Neue" font-size="16" font-weight="700" fill="black" x="75.114" y="16">Website / Core</tspan>
          <tspan font-family="Helvetica Neue" font-size="16" font-style="italic" font-weight="400" fill="black" x="65.17" y="34.46411">Ruby on Rails, API</tspan>
        </text>
      </g>
      <g id="Graphic_3">
        <rect x="702" y="715" width="157" height="68" fill="white"/>
        <path d="M 702 715 L 859 715 L 859 783 L 702 783 Z" stroke="gray" stroke-linecap="round" stroke-linejoin="round" stroke-dasharray="4.0,4.0" stroke-width="1"/>
        <text transform="translate(707 720.3119)" fill="black">
          <tspan font-family="Helvetica Neue" font-size="16" font-weight="700" fill="black" x="28.628" y="16">Real money </tspan>
          <tspan font-family="Helvetica Neue" font-size="16" font-weight="700" fill="black" x="14.428" y="35.46411">gaming module</tspan>
          <tspan font-family="Helvetica Neue" font-size="16" font-style="italic" font-weight="400" fill="black" x="45.796" y="53.92822">Go, API</tspan>
        </text>
      </g>
      <g id="Line_4">
        <line x1="831.3686" y1="644.5" x2="801.3836" y2="706.0986" marker-end="url(#FilledArrow_Marker)" stroke="black" stroke-linecap="round" stroke-linejoin="round" stroke-width="1"/>
      </g>
      <g id="Graphic_10">
        <rect x="269" y="288" width="355.5" height="726.5" fill="#ffffc0"/>
        <path d="M 269 288 L 624.5 288 L 624.5 1014.5 L 269 1014.5 Z" stroke="gray" stroke-linecap="round" stroke-linejoin="round" stroke-dasharray="4.0,4.0" stroke-width="1"/>
        <text transform="translate(274 293)" fill="black" fill-opacity=".5">
          <tspan font-family="Helvetica Neue" font-size="24" font-weight="700" fill="black" fill-opacity=".5" x="0" y="23">IaaS provider</tspan>
          <tspan font-family="Helvetica Neue" font-size="24" font-weight="700" fill="black" fill-opacity=".5" x="0" y="51.672">(e.g. Google Cloud)</tspan>
        </text>
      </g>
      <g id="Graphic_11">
        <rect x="310.5" y="532" width="272.5" height="112.5" fill="white"/>
        <path d="M 310.5 532 L 583 532 L 583 644.5 L 310.5 644.5 Z" stroke="gray" stroke-linecap="round" stroke-linejoin="round" stroke-dasharray="4.0,4.0" stroke-width="1"/>
        <text transform="translate(315.5 578.51794)" fill="black">
          <tspan font-family="Helvetica Neue" font-size="16" font-weight="700" fill="black" x="55.578" y="16">Relational database</tspan>
        </text>
      </g>
      <g id="Graphic_12">
        <rect x="310.5" y="670.5" width="272.5" height="112.5" fill="white"/>
        <path d="M 310.5 670.5 L 583 670.5 L 583 783 L 310.5 783 Z" stroke="gray" stroke-linecap="round" stroke-linejoin="round" stroke-dasharray="4.0,4.0" stroke-width="1"/>
        <text transform="translate(315.5 717.01794)" fill="black">
          <tspan font-family="Helvetica Neue" font-size="16" font-weight="700" fill="black" x="40.29" y="16">Cache store (e.g. Redis)</tspan>
        </text>
      </g>
      <g id="Graphic_13">
        <rect x="1093" y="288" width="355.5" height="726.5" fill="#ffffc0"/>
        <path d="M 1093 288 L 1448.5 288 L 1448.5 1014.5 L 1093 1014.5 Z" stroke="gray" stroke-linecap="round" stroke-linejoin="round" stroke-dasharray="4.0,4.0" stroke-width="1"/>
        <text transform="translate(1098 293)" fill="black" fill-opacity=".5">
          <tspan font-family="Helvetica Neue" font-size="24" font-weight="700" fill="black" fill-opacity=".5" x="0" y="23">External parties</tspan>
        </text>
      </g>
      <g id="Graphic_5">
        <rect x="1134.5" y="453" width="272.5" height="112.5" fill="white"/>
        <path d="M 1134.5 453 L 1407 453 L 1407 565.5 L 1134.5 565.5 Z" stroke="gray" stroke-linecap="round" stroke-linejoin="round" stroke-dasharray="4.0,4.0" stroke-width="1"/>
        <text transform="translate(1139.5 490.29395)" fill="black">
          <tspan font-family="Helvetica Neue" font-size="16" font-weight="700" fill="black" x="59.69" y="16">Payment System X</tspan>
          <tspan font-family="Helvetica Neue" font-size="16" font-style="italic" font-weight="400" fill="black" x="86.066" y="34.46411">external, API</tspan>
        </text>
      </g>
      <g id="Graphic_6">
        <rect x="1134.5" y="655.5" width="272.5" height="112.5" fill="white"/>
        <path d="M 1134.5 655.5 L 1407 655.5 L 1407 768 L 1134.5 768 Z" stroke="gray" stroke-linecap="round" stroke-linejoin="round" stroke-dasharray="4.0,4.0" stroke-width="1"/>
        <text transform="translate(1139.5 692.79395)" fill="black">
          <tspan font-family="Helvetica Neue" font-size="16" font-weight="700" fill="black" x="59.69" y="16">Payment System Y</tspan>
          <tspan font-family="Helvetica Neue" font-size="16" font-style="italic" font-weight="400" fill="black" x="86.066" y="34.46411">external, API</tspan>
        </text>
      </g>
      <g id="Line_7">
        <line x1="1004.7229" y1="560.26006" x2="1124.7771" y2="537.23994" marker-end="url(#FilledArrow_Marker)" marker-start="url(#FilledArrow_Marker_2)" stroke="black" stroke-linecap="round" stroke-linejoin="round" stroke-width="1"/>
      </g>
      <g id="Line_8">
        <line x1="1004.4831" y1="631.93456" x2="1125.0169" y2="668.0654" marker-end="url(#FilledArrow_Marker)" marker-start="url(#FilledArrow_Marker_2)" stroke="black" stroke-linecap="round" stroke-linejoin="round" stroke-width="1"/>
      </g>
      <g id="Line_14">
        <line x1="671.1" y1="651.25" x2="634.4" y2="651.25" marker-end="url(#FilledArrow_Marker)" marker-start="url(#FilledArrow_Marker_2)" stroke="black" stroke-linecap="round" stroke-linejoin="round" stroke-width="1"/>
      </g>
      <g id="Graphic_16">
        <ellipse cx="1009.5" cy="161.75" rx="64.5001030646725" ry="61.7500986704421" fill="#ccc"/>
        <path d="M 1055.1083 118.0862 C 1080.2973 142.20106 1080.2973 181.29894 1055.1083 205.4138 C 1029.9195 229.52878 989.0805 229.52878 963.8917 205.4138 C 938.7027 181.29894 938.7027 142.20106 963.8917 118.0862 C 989.0805 93.97122 1029.9195 93.97122 1055.1083 118.0862" stroke="gray" stroke-linecap="round" stroke-linejoin="round" stroke-dasharray="4.0,4.0" stroke-width="1"/>
        <text transform="translate(962.9 152.526)" fill="black">
          <tspan font-family="Helvetica Neue" font-size="16" font-weight="400" fill="black" x="14.887998" y="15">End user</tspan>
        </text>
      </g>
      <g id="Line_17">
        <line x1="979.0423" y1="216.20015" x2="895.0475" y2="366.35987" marker-end="url(#FilledArrow_Marker)" stroke="black" stroke-linecap="round" stroke-linejoin="round" stroke-dasharray="8.0,4.0,1.0,4.0" stroke-width="1"/>
      </g>
      <g id="Line_18">
        <path d="M 1073.9405 159.08966 C 1130.8001 161.10314 1211.3827 175.42042 1256.0606 234.84848 C 1301.0241 294.65638 1296.7778 383.0682 1286.5178 443.25716" marker-end="url(#FilledArrow_Marker)" stroke="black" stroke-linecap="round" stroke-linejoin="round" stroke-dasharray="8.0,4.0,1.0,4.0" stroke-width="1"/>
      </g>
      <g id="Line_19">
        <path d="M 1073.9903 160.67385 C 1206.5603 160.96784 1502.056 175.38087 1559.091 295.45455 C 1610.469 403.61906 1451.5718 562.21674 1349.5764 649.10694" marker-end="url(#FilledArrow_Marker)" stroke="black" stroke-linecap="round" stroke-linejoin="round" stroke-dasharray="8.0,4.0,1.0,4.0" stroke-width="1"/>
      </g>
      <g id="Graphic_20">
        <rect x="722.5" y="375" width="272.5" height="112.5" fill="white"/>
        <path d="M 722.5 375 L 995 375 L 995 487.5 L 722.5 487.5 Z" stroke="gray" stroke-linecap="round" stroke-linejoin="round" stroke-dasharray="4.0,4.0" stroke-width="1"/>
        <text transform="translate(727.5 412.29395)" fill="black">
          <tspan font-family="Helvetica Neue" font-size="16" font-weight="700" fill="black" x="96.866" y="16">Frontend</tspan>
          <tspan font-family="Helvetica Neue" font-size="16" font-style="italic" font-weight="400" fill="black" x="67.25" y="34.46411">NextJS, HTML/JS</tspan>
        </text>
      </g>
      <g id="Line_21">
        <line x1="858.75" y1="487.5" x2="858.75" y2="522.1" marker-end="url(#FilledArrow_Marker)" stroke="black" stroke-linecap="round" stroke-linejoin="round" stroke-width="1"/>
      </g>
      <g id="Graphic_22">
        <rect x="846" y="805" width="157" height="68" fill="white"/>
        <path d="M 846 805 L 1003 805 L 1003 873 L 846 873 Z" stroke="gray" stroke-linecap="round" stroke-linejoin="round" stroke-dasharray="4.0,4.0" stroke-width="1"/>
        <text transform="translate(851 810.3119)" fill="black">
          <tspan font-family="Helvetica Neue" font-size="16" font-weight="700" fill="black" x="29.508" y="16">Play money </tspan>
          <tspan font-family="Helvetica Neue" font-size="16" font-weight="700" fill="black" x="14.428" y="35.46411">gaming module</tspan>
          <tspan font-family="Helvetica Neue" font-size="16" font-style="italic" font-weight="400" fill="black" x="45.796" y="53.92822">Go, API</tspan>
        </text>
      </g>
      <g id="Line_23">
        <line x1="873.4995" y1="644.5" x2="913.0737" y2="795.4237" marker-end="url(#FilledArrow_Marker)" stroke="black" stroke-linecap="round" stroke-linejoin="round" stroke-width="1"/>
      </g>
    </g>
  </g>
</svg>
