{
    "log_dir": "../logs",
    "model_summary_dir": "../models/summaries",
    "checkpoint_dir": "../models/checkpoints",
    "inference_output_dir": "../output",
    "epochs": 10,
    "batch_size": 256,
    "gradient_accumulation_steps": 1,
    "warmup_steps": 1,
    "dropout": 0.5,
    "max_length": 30, 
    "learning_rate": 1e-4,
    "clip": 0.5,
    "cuda": true,
    "warmup_proportion" : 0.1,
    "summary_step": 50,
    "adam_epsilon": 1e-8,
    "gpu_id": [3,4],
    "max_grad_norm": 1,
    "evaluate_during_training": true,
    "logging_steps": 50,
    "save_steps": 50
}