Designator,Footprint,Quantity,Value,LCSC Part #
12V_switch1,PinHeader_1x02_P2.54mm_Vertical,1,Conn_01x02_Male,
B1,SPARKFUN_LOGIC_LEVEL_CONVERTER,1,SPARKFUN_LOGIC_LEVEL_CONVERTER,
C2,CP_Elec_8x10.5,1,100uF,
C3,0603,1,100nF,
C4,CP_Elec_8x10.5,1,220uF,
C5,0603,1,100nF,
D1,0603,1,LED,
D14,2114,1,SS34,
D15,0603,1,LED,
D2,0603,1,LED,
"FLASHLIGHT1, FLASHLIGHT2, FSTROBE1",JST_PH_B2B-PH-K_1x02_P2.00mm_Vertical,3,Conn_01x02,
"I2C1, RXTX1, light_barrier1",JST_PH_B4B-PH-K_1x04_P2.00mm_Vertical,3,Conn_01x04,
J7,USB_A_Wuerth_61400826021_Horizontal_Stacked,1,USB_A,
L1,L_Bourns_SRR1260,1,47uH,
"MK1, MK2, MK3, MK4",MountingHole_2.7mm_M2.5,4,M2.5,
P1,PinSocket_2x20_P2.54mm_Vertical,1,Conn_02x20_Odd_Even,
Power1,BarrelJack_Wuerth_6941xx301002,1,Barrel_Jack_MountingPin,
"Q1, Q2",TO-220-3_Vertical,2,IRF540N,
R1,0603,1,R,
R10,0603,1,220Ω,
R11,0603,1,330,
R12,0603,1,1K,
R2,0603,1,R,
R9,0603,1,330Ω,
RV5,Potentiometer_Bourns_3296W_Vertical,1,10K,
U2,TO-263-5_TabPin3,1,LM2596S-ADJ,
