solid OpenSCAD_Model
  facet normal -1 0 0
    outer loop
      vertex 0 16 0
      vertex 0 11 3
      vertex 0 16 7
    endloop
  endfacet
  facet normal -1 0 0
    outer loop
      vertex 0 0 0
      vertex 0 11 3
      vertex 0 16 0
    endloop
  endfacet
  facet normal -1 -0 0
    outer loop
      vertex 0 11 3
      vertex 0 0 0
      vertex 0 2 3
    endloop
  endfacet
  facet normal -1 0 0
    outer loop
      vertex 0 0 4
      vertex 0 2 3
      vertex 0 0 0
    endloop
  endfacet
  facet normal -1 0 0
    outer loop
      vertex 0 2 3
      vertex 0 0 4
      vertex 0 2 4
    endloop
  endfacet
  facet normal -1 -0 0
    outer loop
      vertex 0 16 7
      vertex 0 11 3
      vertex 0 11 7
    endloop
  endfacet
  facet normal 1 0 0
    outer loop
      vertex 42 2 4
      vertex 42 0 4
      vertex 42 2 3
    endloop
  endfacet
  facet normal 1 0 0
    outer loop
      vertex 42 11 3
      vertex 42 16 7
      vertex 42 11 7
    endloop
  endfacet
  facet normal 1 0 0
    outer loop
      vertex 42 16 7
      vertex 42 11 3
      vertex 42 16 0
    endloop
  endfacet
  facet normal 1 0 0
    outer loop
      vertex 42 0 0
      vertex 42 11 3
      vertex 42 2 3
    endloop
  endfacet
  facet normal 1 0 0
    outer loop
      vertex 42 11 3
      vertex 42 0 0
      vertex 42 16 0
    endloop
  endfacet
  facet normal 1 0 0
    outer loop
      vertex 42 0 0
      vertex 42 2 3
      vertex 42 0 4
    endloop
  endfacet
  facet normal -0 0 1
    outer loop
      vertex 0 2 4
      vertex 11 0 4
      vertex 11 2 4
    endloop
  endfacet
  facet normal 0 0 1
    outer loop
      vertex 11 0 4
      vertex 0 2 4
      vertex 0 0 4
    endloop
  endfacet
  facet normal -0 0 1
    outer loop
      vertex 31 2 4
      vertex 42 0 4
      vertex 42 2 4
    endloop
  endfacet
  facet normal 0 0 1
    outer loop
      vertex 42 0 4
      vertex 31 2 4
      vertex 31 0 4
    endloop
  endfacet
  facet normal 0 -1 0
    outer loop
      vertex 0 0 0
      vertex 11 0 4
      vertex 0 0 4
    endloop
  endfacet
  facet normal 0 -1 -0
    outer loop
      vertex 11 0 4
      vertex 0 0 0
      vertex 11 0 0
    endloop
  endfacet
  facet normal 0 -1 0
    outer loop
      vertex 31 0 0
      vertex 42 0 4
      vertex 31 0 4
    endloop
  endfacet
  facet normal 0 -1 -0
    outer loop
      vertex 42 0 4
      vertex 31 0 0
      vertex 42 0 0
    endloop
  endfacet
  facet normal -0 0 1
    outer loop
      vertex 0 16 7
      vertex 42 11 7
      vertex 42 16 7
    endloop
  endfacet
  facet normal 0 0 1
    outer loop
      vertex 42 11 7
      vertex 0 16 7
      vertex 0 11 7
    endloop
  endfacet
  facet normal 0 -1 0
    outer loop
      vertex 0 11 3
      vertex 42 11 7
      vertex 0 11 7
    endloop
  endfacet
  facet normal 0 -1 -0
    outer loop
      vertex 42 11 7
      vertex 0 11 3
      vertex 42 11 3
    endloop
  endfacet
  facet normal 0 0 1
    outer loop
      vertex 42 11 3
      vertex 38.3 7 3
      vertex 42 2 3
    endloop
  endfacet
  facet normal 0 0 1
    outer loop
      vertex 42 11 3
      vertex 38.2364 7.40172 3
      vertex 38.3 7 3
    endloop
  endfacet
  facet normal 0 0 1
    outer loop
      vertex 42 11 3
      vertex 38.0517 7.76412 3
      vertex 38.2364 7.40172 3
    endloop
  endfacet
  facet normal 0 0 1
    outer loop
      vertex 42 11 3
      vertex 37.7641 8.05172 3
      vertex 38.0517 7.76412 3
    endloop
  endfacet
  facet normal 0 0 1
    outer loop
      vertex 42 11 3
      vertex 37.4017 8.23637 3
      vertex 37.7641 8.05172 3
    endloop
  endfacet
  facet normal 0 0 1
    outer loop
      vertex 42 11 3
      vertex 37 8.3 3
      vertex 37.4017 8.23637 3
    endloop
  endfacet
  facet normal 0 0 1
    outer loop
      vertex 42 11 3
      vertex 36.5983 8.23637 3
      vertex 37 8.3 3
    endloop
  endfacet
  facet normal -0 0 1
    outer loop
      vertex 31 8.5 3
      vertex 36.5983 8.23637 3
      vertex 42 11 3
    endloop
  endfacet
  facet normal 0 0 1
    outer loop
      vertex 35.7636 7.40172 3
      vertex 31 8.5 3
      vertex 35.7 7 3
    endloop
  endfacet
  facet normal 0 0 1
    outer loop
      vertex 35.9483 7.76412 3
      vertex 31 8.5 3
      vertex 35.7636 7.40172 3
    endloop
  endfacet
  facet normal 0 0 1
    outer loop
      vertex 36.2359 8.05172 3
      vertex 31 8.5 3
      vertex 35.9483 7.76412 3
    endloop
  endfacet
  facet normal 0 0 1
    outer loop
      vertex 36.5983 8.23637 3
      vertex 31 8.5 3
      vertex 36.2359 8.05172 3
    endloop
  endfacet
  facet normal 0 0 1
    outer loop
      vertex 42 11 3
      vertex 11 8.5 3
      vertex 31 8.5 3
    endloop
  endfacet
  facet normal 0 0 1
    outer loop
      vertex 6.23637 6.59828 3
      vertex 11 8.5 3
      vertex 6.3 7 3
    endloop
  endfacet
  facet normal 0 0 1
    outer loop
      vertex 11 8.5 3
      vertex 6.23637 7.40172 3
      vertex 6.3 7 3
    endloop
  endfacet
  facet normal 0 0 1
    outer loop
      vertex 11 8.5 3
      vertex 6.05172 7.76412 3
      vertex 6.23637 7.40172 3
    endloop
  endfacet
  facet normal 0 0 1
    outer loop
      vertex 11 8.5 3
      vertex 5.76412 8.05172 3
      vertex 6.05172 7.76412 3
    endloop
  endfacet
  facet normal 0 0 1
    outer loop
      vertex 11 8.5 3
      vertex 5.40172 8.23637 3
      vertex 5.76412 8.05172 3
    endloop
  endfacet
  facet normal -0 0 1
    outer loop
      vertex 0 11 3
      vertex 11 8.5 3
      vertex 42 11 3
    endloop
  endfacet
  facet normal 0 0 1
    outer loop
      vertex 11 8.5 3
      vertex 0 11 3
      vertex 5.40172 8.23637 3
    endloop
  endfacet
  facet normal 0 0 1
    outer loop
      vertex 3.76363 7.40172 3
      vertex 0 11 3
      vertex 3.7 7 3
    endloop
  endfacet
  facet normal 0 0 1
    outer loop
      vertex 3.94828 7.76412 3
      vertex 0 11 3
      vertex 3.76363 7.40172 3
    endloop
  endfacet
  facet normal 0 0 1
    outer loop
      vertex 4.23588 8.05172 3
      vertex 0 11 3
      vertex 3.94828 7.76412 3
    endloop
  endfacet
  facet normal 0 0 1
    outer loop
      vertex 4.59828 8.23637 3
      vertex 0 11 3
      vertex 4.23588 8.05172 3
    endloop
  endfacet
  facet normal 0 0 1
    outer loop
      vertex 5 8.3 3
      vertex 0 11 3
      vertex 4.59828 8.23637 3
    endloop
  endfacet
  facet normal 0 0 1
    outer loop
      vertex 5.40172 8.23637 3
      vertex 0 11 3
      vertex 5 8.3 3
    endloop
  endfacet
  facet normal -0 0 1
    outer loop
      vertex 38.2364 6.59828 3
      vertex 42 2 3
      vertex 38.3 7 3
    endloop
  endfacet
  facet normal -0 0 1
    outer loop
      vertex 38.0517 6.23588 3
      vertex 42 2 3
      vertex 38.2364 6.59828 3
    endloop
  endfacet
  facet normal -0 0 1
    outer loop
      vertex 37.7641 5.94828 3
      vertex 42 2 3
      vertex 38.0517 6.23588 3
    endloop
  endfacet
  facet normal -0 0 1
    outer loop
      vertex 37.4017 5.76363 3
      vertex 42 2 3
      vertex 37.7641 5.94828 3
    endloop
  endfacet
  facet normal -0 0 1
    outer loop
      vertex 37 5.7 3
      vertex 42 2 3
      vertex 37.4017 5.76363 3
    endloop
  endfacet
  facet normal 0 0 1
    outer loop
      vertex 31 2 3
      vertex 37 5.7 3
      vertex 36.5983 5.76363 3
    endloop
  endfacet
  facet normal 0 0 1
    outer loop
      vertex 31 2 3
      vertex 36.5983 5.76363 3
      vertex 36.2359 5.94828 3
    endloop
  endfacet
  facet normal 0 0 1
    outer loop
      vertex 31 8.5 3
      vertex 35.7636 6.59828 3
      vertex 35.7 7 3
    endloop
  endfacet
  facet normal 0 0 1
    outer loop
      vertex 31 2 3
      vertex 35.7636 6.59828 3
      vertex 31 8.5 3
    endloop
  endfacet
  facet normal 0 0 1
    outer loop
      vertex 35.7636 6.59828 3
      vertex 31 2 3
      vertex 35.9483 6.23588 3
    endloop
  endfacet
  facet normal 0 0 1
    outer loop
      vertex 35.9483 6.23588 3
      vertex 31 2 3
      vertex 36.2359 5.94828 3
    endloop
  endfacet
  facet normal 0 0 1
    outer loop
      vertex 37 5.7 3
      vertex 31 2 3
      vertex 42 2 3
    endloop
  endfacet
  facet normal 0 0 1
    outer loop
      vertex 11 8.5 3
      vertex 6.23637 6.59828 3
      vertex 11 2 3
    endloop
  endfacet
  facet normal -0 0 1
    outer loop
      vertex 6.05172 6.23588 3
      vertex 11 2 3
      vertex 6.23637 6.59828 3
    endloop
  endfacet
  facet normal -0 0 1
    outer loop
      vertex 5.76412 5.94828 3
      vertex 11 2 3
      vertex 6.05172 6.23588 3
    endloop
  endfacet
  facet normal -0 0 1
    outer loop
      vertex 5.40172 5.76363 3
      vertex 11 2 3
      vertex 5.76412 5.94828 3
    endloop
  endfacet
  facet normal -0 0 1
    outer loop
      vertex 5 5.7 3
      vertex 11 2 3
      vertex 5.40172 5.76363 3
    endloop
  endfacet
  facet normal 0 0 1
    outer loop
      vertex 0 2 3
      vertex 5 5.7 3
      vertex 4.59828 5.76363 3
    endloop
  endfacet
  facet normal 0 0 1
    outer loop
      vertex 0 2 3
      vertex 4.59828 5.76363 3
      vertex 4.23588 5.94828 3
    endloop
  endfacet
  facet normal 0 0 1
    outer loop
      vertex 0 2 3
      vertex 3.7 7 3
      vertex 0 11 3
    endloop
  endfacet
  facet normal 0 0 1
    outer loop
      vertex 3.7 7 3
      vertex 0 2 3
      vertex 3.76363 6.59828 3
    endloop
  endfacet
  facet normal 0 0 1
    outer loop
      vertex 5 5.7 3
      vertex 0 2 3
      vertex 11 2 3
    endloop
  endfacet
  facet normal 0 0 1
    outer loop
      vertex 3.94828 6.23588 3
      vertex 0 2 3
      vertex 4.23588 5.94828 3
    endloop
  endfacet
  facet normal 0 0 1
    outer loop
      vertex 3.76363 6.59828 3
      vertex 0 2 3
      vertex 3.94828 6.23588 3
    endloop
  endfacet
  facet normal 0 1 -0
    outer loop
      vertex 11 2 3
      vertex 0 2 4
      vertex 11 2 4
    endloop
  endfacet
  facet normal 0 1 0
    outer loop
      vertex 0 2 4
      vertex 11 2 3
      vertex 0 2 3
    endloop
  endfacet
  facet normal 0 1 -0
    outer loop
      vertex 42 2 3
      vertex 31 2 4
      vertex 42 2 4
    endloop
  endfacet
  facet normal 0 1 0
    outer loop
      vertex 31 2 4
      vertex 42 2 3
      vertex 31 2 3
    endloop
  endfacet
  facet normal -0.987687 -0.156444 0
    outer loop
      vertex 6.3 7 0
      vertex 6.23637 7.40172 3
      vertex 6.23637 7.40172 0
    endloop
  endfacet
  facet normal -0.987687 -0.156444 0
    outer loop
      vertex 6.23637 7.40172 3
      vertex 6.3 7 0
      vertex 6.3 7 3
    endloop
  endfacet
  facet normal -0.156444 -0.987687 0
    outer loop
      vertex 5 8.3 0
      vertex 5.40172 8.23637 3
      vertex 5 8.3 3
    endloop
  endfacet
  facet normal -0.156444 -0.987687 -0
    outer loop
      vertex 5.40172 8.23637 3
      vertex 5 8.3 0
      vertex 5.40172 8.23637 0
    endloop
  endfacet
  facet normal 0.987687 0.156444 0
    outer loop
      vertex 3.76363 6.59828 3
      vertex 3.7 7 0
      vertex 3.7 7 3
    endloop
  endfacet
  facet normal 0.987687 0.156444 0
    outer loop
      vertex 3.7 7 0
      vertex 3.76363 6.59828 3
      vertex 3.76363 6.59828 0
    endloop
  endfacet
  facet normal -0.453987 0.891009 0
    outer loop
      vertex 5.76412 5.94828 0
      vertex 5.40172 5.76363 3
      vertex 5.76412 5.94828 3
    endloop
  endfacet
  facet normal -0.453987 0.891009 0
    outer loop
      vertex 5.40172 5.76363 3
      vertex 5.76412 5.94828 0
      vertex 5.40172 5.76363 0
    endloop
  endfacet
  facet normal -0.156444 0.987687 0
    outer loop
      vertex 5.40172 5.76363 0
      vertex 5 5.7 3
      vertex 5.40172 5.76363 3
    endloop
  endfacet
  facet normal -0.156444 0.987687 0
    outer loop
      vertex 5 5.7 3
      vertex 5.40172 5.76363 0
      vertex 5 5.7 0
    endloop
  endfacet
  facet normal -0.891009 -0.453987 0
    outer loop
      vertex 6.23637 7.40172 0
      vertex 6.05172 7.76412 3
      vertex 6.05172 7.76412 0
    endloop
  endfacet
  facet normal -0.891009 -0.453987 0
    outer loop
      vertex 6.05172 7.76412 3
      vertex 6.23637 7.40172 0
      vertex 6.23637 7.40172 3
    endloop
  endfacet
  facet normal 0.156444 -0.987687 0
    outer loop
      vertex 4.59828 8.23637 0
      vertex 5 8.3 3
      vertex 4.59828 8.23637 3
    endloop
  endfacet
  facet normal 0.156444 -0.987687 0
    outer loop
      vertex 5 8.3 3
      vertex 4.59828 8.23637 0
      vertex 5 8.3 0
    endloop
  endfacet
  facet normal 0 0 -1
    outer loop
      vertex 6.05172 6.23588 0
      vertex 11 8.5 0
      vertex 11 0 0
    endloop
  endfacet
  facet normal 0 0 -1
    outer loop
      vertex 11 8.5 0
      vertex 6.23637 6.59828 0
      vertex 6.3 7 0
    endloop
  endfacet
  facet normal 0 0 -1
    outer loop
      vertex 11 8.5 0
      vertex 6.05172 6.23588 0
      vertex 6.23637 6.59828 0
    endloop
  endfacet
  facet normal 0 0 -1
    outer loop
      vertex 11 0 0
      vertex 5.76412 5.94828 0
      vertex 6.05172 6.23588 0
    endloop
  endfacet
  facet normal 0 0 -1
    outer loop
      vertex 11 0 0
      vertex 5.40172 5.76363 0
      vertex 5.76412 5.94828 0
    endloop
  endfacet
  facet normal 0 0 -1
    outer loop
      vertex 11 0 0
      vertex 5 5.7 0
      vertex 5.40172 5.76363 0
    endloop
  endfacet
  facet normal 0 0 -1
    outer loop
      vertex 0 0 0
      vertex 5 5.7 0
      vertex 11 0 0
    endloop
  endfacet
  facet normal -0 0 -1
    outer loop
      vertex 5 5.7 0
      vertex 0 0 0
      vertex 4.59828 5.76363 0
    endloop
  endfacet
  facet normal -0 0 -1
    outer loop
      vertex 3.76363 6.59828 0
      vertex 0 0 0
      vertex 3.7 7 0
    endloop
  endfacet
  facet normal -0 0 -1
    outer loop
      vertex 3.94828 6.23588 0
      vertex 0 0 0
      vertex 3.76363 6.59828 0
    endloop
  endfacet
  facet normal -0 0 -1
    outer loop
      vertex 4.23588 5.94828 0
      vertex 0 0 0
      vertex 3.94828 6.23588 0
    endloop
  endfacet
  facet normal -0 0 -1
    outer loop
      vertex 4.59828 5.76363 0
      vertex 0 0 0
      vertex 4.23588 5.94828 0
    endloop
  endfacet
  facet normal 0 0 -1
    outer loop
      vertex 42 0 0
      vertex 38.3 7 0
      vertex 42 16 0
    endloop
  endfacet
  facet normal 0 0 -1
    outer loop
      vertex 42 0 0
      vertex 38.2364 6.59828 0
      vertex 38.3 7 0
    endloop
  endfacet
  facet normal 0 0 -1
    outer loop
      vertex 42 0 0
      vertex 38.0517 6.23588 0
      vertex 38.2364 6.59828 0
    endloop
  endfacet
  facet normal 0 0 -1
    outer loop
      vertex 42 0 0
      vertex 37.7641 5.94828 0
      vertex 38.0517 6.23588 0
    endloop
  endfacet
  facet normal 0 0 -1
    outer loop
      vertex 42 0 0
      vertex 37.4017 5.76363 0
      vertex 37.7641 5.94828 0
    endloop
  endfacet
  facet normal 0 0 -1
    outer loop
      vertex 42 0 0
      vertex 37 5.7 0
      vertex 37.4017 5.76363 0
    endloop
  endfacet
  facet normal 0 0 -1
    outer loop
      vertex 31 0 0
      vertex 37 5.7 0
      vertex 42 0 0
    endloop
  endfacet
  facet normal -0 0 -1
    outer loop
      vertex 37 5.7 0
      vertex 31 0 0
      vertex 36.5983 5.76363 0
    endloop
  endfacet
  facet normal -0 0 -1
    outer loop
      vertex 36.5983 5.76363 0
      vertex 31 0 0
      vertex 36.2359 5.94828 0
    endloop
  endfacet
  facet normal 0 0 -1
    outer loop
      vertex 35.9483 6.23588 0
      vertex 31 8.5 0
      vertex 35.7636 6.59828 0
    endloop
  endfacet
  facet normal 0 0 -1
    outer loop
      vertex 31 8.5 0
      vertex 35.9483 6.23588 0
      vertex 31 0 0
    endloop
  endfacet
  facet normal -0 0 -1
    outer loop
      vertex 36.2359 5.94828 0
      vertex 31 0 0
      vertex 35.9483 6.23588 0
    endloop
  endfacet
  facet normal 0 0 -1
    outer loop
      vertex 38.2364 7.40172 0
      vertex 42 16 0
      vertex 38.3 7 0
    endloop
  endfacet
  facet normal 0 0 -1
    outer loop
      vertex 38.0517 7.76412 0
      vertex 42 16 0
      vertex 38.2364 7.40172 0
    endloop
  endfacet
  facet normal 0 0 -1
    outer loop
      vertex 37.7641 8.05172 0
      vertex 42 16 0
      vertex 38.0517 7.76412 0
    endloop
  endfacet
  facet normal 0 0 -1
    outer loop
      vertex 37.4017 8.23637 0
      vertex 42 16 0
      vertex 37.7641 8.05172 0
    endloop
  endfacet
  facet normal 0 0 -1
    outer loop
      vertex 37 8.3 0
      vertex 42 16 0
      vertex 37.4017 8.23637 0
    endloop
  endfacet
  facet normal 0 0 -1
    outer loop
      vertex 36.5983 8.23637 0
      vertex 42 16 0
      vertex 37 8.3 0
    endloop
  endfacet
  facet normal 0 0 -1
    outer loop
      vertex 31 8.5 0
      vertex 36.5983 8.23637 0
      vertex 36.2359 8.05172 0
    endloop
  endfacet
  facet normal 0 0 -1
    outer loop
      vertex 31 8.5 0
      vertex 36.2359 8.05172 0
      vertex 35.9483 7.76412 0
    endloop
  endfacet
  facet normal 0 0 -1
    outer loop
      vertex 35.7636 6.59828 0
      vertex 31 8.5 0
      vertex 35.7 7 0
    endloop
  endfacet
  facet normal 0 0 -1
    outer loop
      vertex 35.7 7 0
      vertex 31 8.5 0
      vertex 35.7636 7.40172 0
    endloop
  endfacet
  facet normal 0 0 -1
    outer loop
      vertex 35.7636 7.40172 0
      vertex 31 8.5 0
      vertex 35.9483 7.76412 0
    endloop
  endfacet
  facet normal 0 0 -1
    outer loop
      vertex 36.5983 8.23637 0
      vertex 31 8.5 0
      vertex 42 16 0
    endloop
  endfacet
  facet normal 0 0 -1
    outer loop
      vertex 11 8.5 0
      vertex 42 16 0
      vertex 31 8.5 0
    endloop
  endfacet
  facet normal 0 0 -1
    outer loop
      vertex 6.23637 7.40172 0
      vertex 11 8.5 0
      vertex 6.3 7 0
    endloop
  endfacet
  facet normal 0 0 -1
    outer loop
      vertex 6.05172 7.76412 0
      vertex 11 8.5 0
      vertex 6.23637 7.40172 0
    endloop
  endfacet
  facet normal 0 0 -1
    outer loop
      vertex 5.76412 8.05172 0
      vertex 11 8.5 0
      vertex 6.05172 7.76412 0
    endloop
  endfacet
  facet normal 0 0 -1
    outer loop
      vertex 5.40172 8.23637 0
      vertex 11 8.5 0
      vertex 5.76412 8.05172 0
    endloop
  endfacet
  facet normal -0 0 -1
    outer loop
      vertex 11 8.5 0
      vertex 5.40172 8.23637 0
      vertex 0 16 0
    endloop
  endfacet
  facet normal 0 0 -1
    outer loop
      vertex 0 16 0
      vertex 5.40172 8.23637 0
      vertex 5 8.3 0
    endloop
  endfacet
  facet normal 0 0 -1
    outer loop
      vertex 0 16 0
      vertex 5 8.3 0
      vertex 4.59828 8.23637 0
    endloop
  endfacet
  facet normal 0 0 -1
    outer loop
      vertex 0 16 0
      vertex 3.7 7 0
      vertex 0 0 0
    endloop
  endfacet
  facet normal 0 0 -1
    outer loop
      vertex 11 8.5 0
      vertex 0 16 0
      vertex 42 16 0
    endloop
  endfacet
  facet normal 0 0 -1
    outer loop
      vertex 4.23588 8.05172 0
      vertex 0 16 0
      vertex 4.59828 8.23637 0
    endloop
  endfacet
  facet normal 0 0 -1
    outer loop
      vertex 3.94828 7.76412 0
      vertex 0 16 0
      vertex 4.23588 8.05172 0
    endloop
  endfacet
  facet normal 0 0 -1
    outer loop
      vertex 3.76363 7.40172 0
      vertex 0 16 0
      vertex 3.94828 7.76412 0
    endloop
  endfacet
  facet normal 0 0 -1
    outer loop
      vertex 3.7 7 0
      vertex 0 16 0
      vertex 3.76363 7.40172 0
    endloop
  endfacet
  facet normal 0.453987 -0.891009 0
    outer loop
      vertex 4.23588 8.05172 0
      vertex 4.59828 8.23637 3
      vertex 4.23588 8.05172 3
    endloop
  endfacet
  facet normal 0.453987 -0.891009 0
    outer loop
      vertex 4.59828 8.23637 3
      vertex 4.23588 8.05172 0
      vertex 4.59828 8.23637 0
    endloop
  endfacet
  facet normal 0.891009 0.453987 0
    outer loop
      vertex 3.94828 6.23588 3
      vertex 3.76363 6.59828 0
      vertex 3.76363 6.59828 3
    endloop
  endfacet
  facet normal 0.891009 0.453987 0
    outer loop
      vertex 3.76363 6.59828 0
      vertex 3.94828 6.23588 3
      vertex 3.94828 6.23588 0
    endloop
  endfacet
  facet normal 0.156444 0.987687 -0
    outer loop
      vertex 5 5.7 0
      vertex 4.59828 5.76363 3
      vertex 5 5.7 3
    endloop
  endfacet
  facet normal 0.156444 0.987687 0
    outer loop
      vertex 4.59828 5.76363 3
      vertex 5 5.7 0
      vertex 4.59828 5.76363 0
    endloop
  endfacet
  facet normal -0.707107 -0.707107 0
    outer loop
      vertex 6.05172 7.76412 0
      vertex 5.76412 8.05172 3
      vertex 5.76412 8.05172 0
    endloop
  endfacet
  facet normal -0.707107 -0.707107 0
    outer loop
      vertex 5.76412 8.05172 3
      vertex 6.05172 7.76412 0
      vertex 6.05172 7.76412 3
    endloop
  endfacet
  facet normal -0.453987 -0.891009 0
    outer loop
      vertex 5.40172 8.23637 0
      vertex 5.76412 8.05172 3
      vertex 5.40172 8.23637 3
    endloop
  endfacet
  facet normal -0.453987 -0.891009 -0
    outer loop
      vertex 5.76412 8.05172 3
      vertex 5.40172 8.23637 0
      vertex 5.76412 8.05172 0
    endloop
  endfacet
  facet normal 0.987687 -0.156444 0
    outer loop
      vertex 3.7 7 3
      vertex 3.76363 7.40172 0
      vertex 3.76363 7.40172 3
    endloop
  endfacet
  facet normal 0.987687 -0.156444 0
    outer loop
      vertex 3.76363 7.40172 0
      vertex 3.7 7 3
      vertex 3.7 7 0
    endloop
  endfacet
  facet normal 0.707107 -0.707107 0
    outer loop
      vertex 3.94828 7.76412 3
      vertex 4.23588 8.05172 0
      vertex 4.23588 8.05172 3
    endloop
  endfacet
  facet normal 0.707107 -0.707107 0
    outer loop
      vertex 4.23588 8.05172 0
      vertex 3.94828 7.76412 3
      vertex 3.94828 7.76412 0
    endloop
  endfacet
  facet normal 0.891009 -0.453987 0
    outer loop
      vertex 3.76363 7.40172 3
      vertex 3.94828 7.76412 0
      vertex 3.94828 7.76412 3
    endloop
  endfacet
  facet normal 0.891009 -0.453987 0
    outer loop
      vertex 3.94828 7.76412 0
      vertex 3.76363 7.40172 3
      vertex 3.76363 7.40172 0
    endloop
  endfacet
  facet normal -0.707107 0.707107 0
    outer loop
      vertex 5.76412 5.94828 0
      vertex 6.05172 6.23588 3
      vertex 6.05172 6.23588 0
    endloop
  endfacet
  facet normal -0.707107 0.707107 0
    outer loop
      vertex 6.05172 6.23588 3
      vertex 5.76412 5.94828 0
      vertex 5.76412 5.94828 3
    endloop
  endfacet
  facet normal -0.987687 0.156444 0
    outer loop
      vertex 6.23637 6.59828 0
      vertex 6.3 7 3
      vertex 6.3 7 0
    endloop
  endfacet
  facet normal -0.987687 0.156444 0
    outer loop
      vertex 6.3 7 3
      vertex 6.23637 6.59828 0
      vertex 6.23637 6.59828 3
    endloop
  endfacet
  facet normal 0.707107 0.707107 0
    outer loop
      vertex 4.23588 5.94828 3
      vertex 3.94828 6.23588 0
      vertex 3.94828 6.23588 3
    endloop
  endfacet
  facet normal 0.707107 0.707107 0
    outer loop
      vertex 3.94828 6.23588 0
      vertex 4.23588 5.94828 3
      vertex 4.23588 5.94828 0
    endloop
  endfacet
  facet normal 0.453987 0.891009 -0
    outer loop
      vertex 4.59828 5.76363 0
      vertex 4.23588 5.94828 3
      vertex 4.59828 5.76363 3
    endloop
  endfacet
  facet normal 0.453987 0.891009 0
    outer loop
      vertex 4.23588 5.94828 3
      vertex 4.59828 5.76363 0
      vertex 4.23588 5.94828 0
    endloop
  endfacet
  facet normal -0.891009 0.453987 0
    outer loop
      vertex 6.05172 6.23588 0
      vertex 6.23637 6.59828 3
      vertex 6.23637 6.59828 0
    endloop
  endfacet
  facet normal -0.891009 0.453987 0
    outer loop
      vertex 6.23637 6.59828 3
      vertex 6.05172 6.23588 0
      vertex 6.05172 6.23588 3
    endloop
  endfacet
  facet normal -0.987698 -0.156372 0
    outer loop
      vertex 38.3 7 0
      vertex 38.2364 7.40172 3
      vertex 38.2364 7.40172 0
    endloop
  endfacet
  facet normal -0.987698 -0.156372 0
    outer loop
      vertex 38.2364 7.40172 3
      vertex 38.3 7 0
      vertex 38.3 7 3
    endloop
  endfacet
  facet normal -0.156451 -0.987686 0
    outer loop
      vertex 37 8.3 0
      vertex 37.4017 8.23637 3
      vertex 37 8.3 3
    endloop
  endfacet
  facet normal -0.156451 -0.987686 -0
    outer loop
      vertex 37.4017 8.23637 3
      vertex 37 8.3 0
      vertex 37.4017 8.23637 0
    endloop
  endfacet
  facet normal 0.987698 0.156372 0
    outer loop
      vertex 35.7636 6.59828 3
      vertex 35.7 7 0
      vertex 35.7 7 3
    endloop
  endfacet
  facet normal 0.987698 0.156372 0
    outer loop
      vertex 35.7 7 0
      vertex 35.7636 6.59828 3
      vertex 35.7636 6.59828 0
    endloop
  endfacet
  facet normal -0.453987 0.891009 0
    outer loop
      vertex 37.7641 5.94828 0
      vertex 37.4017 5.76363 3
      vertex 37.7641 5.94828 3
    endloop
  endfacet
  facet normal -0.453987 0.891009 0
    outer loop
      vertex 37.4017 5.76363 3
      vertex 37.7641 5.94828 0
      vertex 37.4017 5.76363 0
    endloop
  endfacet
  facet normal -0.156451 0.987686 0
    outer loop
      vertex 37.4017 5.76363 0
      vertex 37 5.7 3
      vertex 37.4017 5.76363 3
    endloop
  endfacet
  facet normal -0.156451 0.987686 0
    outer loop
      vertex 37 5.7 3
      vertex 37.4017 5.76363 0
      vertex 37 5.7 0
    endloop
  endfacet
  facet normal -0.890959 -0.454084 0
    outer loop
      vertex 38.2364 7.40172 0
      vertex 38.0517 7.76412 3
      vertex 38.0517 7.76412 0
    endloop
  endfacet
  facet normal -0.890959 -0.454084 0
    outer loop
      vertex 38.0517 7.76412 3
      vertex 38.2364 7.40172 0
      vertex 38.2364 7.40172 3
    endloop
  endfacet
  facet normal 0.156451 -0.987686 0
    outer loop
      vertex 36.5983 8.23637 0
      vertex 37 8.3 3
      vertex 36.5983 8.23637 3
    endloop
  endfacet
  facet normal 0.156451 -0.987686 0
    outer loop
      vertex 37 8.3 3
      vertex 36.5983 8.23637 0
      vertex 37 8.3 0
    endloop
  endfacet
  facet normal 0.453987 -0.891009 0
    outer loop
      vertex 36.2359 8.05172 0
      vertex 36.5983 8.23637 3
      vertex 36.2359 8.05172 3
    endloop
  endfacet
  facet normal 0.453987 -0.891009 0
    outer loop
      vertex 36.5983 8.23637 3
      vertex 36.2359 8.05172 0
      vertex 36.5983 8.23637 0
    endloop
  endfacet
  facet normal 0.890959 0.454084 0
    outer loop
      vertex 35.9483 6.23588 3
      vertex 35.7636 6.59828 0
      vertex 35.7636 6.59828 3
    endloop
  endfacet
  facet normal 0.890959 0.454084 0
    outer loop
      vertex 35.7636 6.59828 0
      vertex 35.9483 6.23588 3
      vertex 35.9483 6.23588 0
    endloop
  endfacet
  facet normal 0.156451 0.987686 -0
    outer loop
      vertex 37 5.7 0
      vertex 36.5983 5.76363 3
      vertex 37 5.7 3
    endloop
  endfacet
  facet normal 0.156451 0.987686 0
    outer loop
      vertex 36.5983 5.76363 3
      vertex 37 5.7 0
      vertex 36.5983 5.76363 0
    endloop
  endfacet
  facet normal -0.707107 -0.707107 0
    outer loop
      vertex 38.0517 7.76412 0
      vertex 37.7641 8.05172 3
      vertex 37.7641 8.05172 0
    endloop
  endfacet
  facet normal -0.707107 -0.707107 0
    outer loop
      vertex 37.7641 8.05172 3
      vertex 38.0517 7.76412 0
      vertex 38.0517 7.76412 3
    endloop
  endfacet
  facet normal -0.453987 -0.891009 0
    outer loop
      vertex 37.4017 8.23637 0
      vertex 37.7641 8.05172 3
      vertex 37.4017 8.23637 3
    endloop
  endfacet
  facet normal -0.453987 -0.891009 -0
    outer loop
      vertex 37.7641 8.05172 3
      vertex 37.4017 8.23637 0
      vertex 37.7641 8.05172 0
    endloop
  endfacet
  facet normal 0.987698 -0.156372 0
    outer loop
      vertex 35.7 7 3
      vertex 35.7636 7.40172 0
      vertex 35.7636 7.40172 3
    endloop
  endfacet
  facet normal 0.987698 -0.156372 0
    outer loop
      vertex 35.7636 7.40172 0
      vertex 35.7 7 3
      vertex 35.7 7 0
    endloop
  endfacet
  facet normal 0.707107 -0.707107 0
    outer loop
      vertex 35.9483 7.76412 3
      vertex 36.2359 8.05172 0
      vertex 36.2359 8.05172 3
    endloop
  endfacet
  facet normal 0.707107 -0.707107 0
    outer loop
      vertex 36.2359 8.05172 0
      vertex 35.9483 7.76412 3
      vertex 35.9483 7.76412 0
    endloop
  endfacet
  facet normal 0.890959 -0.454084 0
    outer loop
      vertex 35.7636 7.40172 3
      vertex 35.9483 7.76412 0
      vertex 35.9483 7.76412 3
    endloop
  endfacet
  facet normal 0.890959 -0.454084 0
    outer loop
      vertex 35.9483 7.76412 0
      vertex 35.7636 7.40172 3
      vertex 35.7636 7.40172 0
    endloop
  endfacet
  facet normal -0.707107 0.707107 0
    outer loop
      vertex 37.7641 5.94828 0
      vertex 38.0517 6.23588 3
      vertex 38.0517 6.23588 0
    endloop
  endfacet
  facet normal -0.707107 0.707107 0
    outer loop
      vertex 38.0517 6.23588 3
      vertex 37.7641 5.94828 0
      vertex 37.7641 5.94828 3
    endloop
  endfacet
  facet normal -0.987698 0.156372 0
    outer loop
      vertex 38.2364 6.59828 0
      vertex 38.3 7 3
      vertex 38.3 7 0
    endloop
  endfacet
  facet normal -0.987698 0.156372 0
    outer loop
      vertex 38.3 7 3
      vertex 38.2364 6.59828 0
      vertex 38.2364 6.59828 3
    endloop
  endfacet
  facet normal 0.707107 0.707107 0
    outer loop
      vertex 36.2359 5.94828 3
      vertex 35.9483 6.23588 0
      vertex 35.9483 6.23588 3
    endloop
  endfacet
  facet normal 0.707107 0.707107 0
    outer loop
      vertex 35.9483 6.23588 0
      vertex 36.2359 5.94828 3
      vertex 36.2359 5.94828 0
    endloop
  endfacet
  facet normal 0.453987 0.891009 -0
    outer loop
      vertex 36.5983 5.76363 0
      vertex 36.2359 5.94828 3
      vertex 36.5983 5.76363 3
    endloop
  endfacet
  facet normal 0.453987 0.891009 0
    outer loop
      vertex 36.2359 5.94828 3
      vertex 36.5983 5.76363 0
      vertex 36.2359 5.94828 0
    endloop
  endfacet
  facet normal -0.890959 0.454084 0
    outer loop
      vertex 38.0517 6.23588 0
      vertex 38.2364 6.59828 3
      vertex 38.2364 6.59828 0
    endloop
  endfacet
  facet normal -0.890959 0.454084 0
    outer loop
      vertex 38.2364 6.59828 3
      vertex 38.0517 6.23588 0
      vertex 38.0517 6.23588 3
    endloop
  endfacet
  facet normal 1 0 0
    outer loop
      vertex 11 2 4
      vertex 11 0 4
      vertex 11 2 3
    endloop
  endfacet
  facet normal 1 -0 0
    outer loop
      vertex 11 2 3
      vertex 11 8.5 0
      vertex 11 8.5 3
    endloop
  endfacet
  facet normal 1 0 0
    outer loop
      vertex 11 2 3
      vertex 11 0 0
      vertex 11 8.5 0
    endloop
  endfacet
  facet normal 1 0 0
    outer loop
      vertex 11 0 0
      vertex 11 2 3
      vertex 11 0 4
    endloop
  endfacet
  facet normal -1 0 0
    outer loop
      vertex 31 8.5 0
      vertex 31 2 3
      vertex 31 8.5 3
    endloop
  endfacet
  facet normal -1 0 0
    outer loop
      vertex 31 0 0
      vertex 31 2 3
      vertex 31 8.5 0
    endloop
  endfacet
  facet normal -1 0 0
    outer loop
      vertex 31 0 4
      vertex 31 2 3
      vertex 31 0 0
    endloop
  endfacet
  facet normal -1 0 0
    outer loop
      vertex 31 2 3
      vertex 31 0 4
      vertex 31 2 4
    endloop
  endfacet
  facet normal 0 -1 0
    outer loop
      vertex 11 8.5 0
      vertex 31 8.5 3
      vertex 11 8.5 3
    endloop
  endfacet
  facet normal 0 -1 -0
    outer loop
      vertex 31 8.5 3
      vertex 11 8.5 0
      vertex 31 8.5 0
    endloop
  endfacet
  facet normal 0 1 -0
    outer loop
      vertex 42 16 0
      vertex 0 16 7
      vertex 42 16 7
    endloop
  endfacet
  facet normal 0 1 0
    outer loop
      vertex 0 16 7
      vertex 42 16 0
      vertex 0 16 0
    endloop
  endfacet
endsolid OpenSCAD_Model
