#list of all websites from https://framagit.org/kin/holosites
#id,url,note
000,holoLinks.ml,website for resolver w/ catch all page 200.html
000,https://allaccessmiami6.wixsite.com/creation-university/copy-of-kauai-the-motherland
000,https://allaccessmiami6.wixsite.com/holosphere
000,https://www.holosphere.gq/
