{
  "project_info": {
    "project_number": "278037249357",
    "project_id": "instagram-flutter-bfe6e",
    "storage_bucket": "instagram-flutter-bfe6e.appspot.com"
  },
  "client": [
    {
      "client_info": {
        "mobilesdk_app_id": "1:278037249357:android:bf53816f349c365b358b04",
        "android_client_info": {
          "package_name": "com.example.fullstack_instagram"
        }
      },
      "oauth_client": [
        {
          "client_id": "278037249357-2ak2p5bgq1qkuqt96vvnq4mmn8jpgvt9.apps.googleusercontent.com",
          "client_type": 3
        }
      ],
      "api_key": [
        {
          "current_key": "AIzaSyB4hfs0wUMoZtkCsDnq7sI_oFzrw9qw1s0"
        }
      ],
      "services": {
        "appinvite_service": {
          "other_platform_oauth_client": [
            {
              "client_id": "278037249357-2ak2p5bgq1qkuqt96vvnq4mmn8jpgvt9.apps.googleusercontent.com",
              "client_type": 3
            }
          ]
        }
      }
    }
  ],
  "configuration_version": "1"
}