{
  "openapi": "3.0.1",
  "info": {
    "title": "ICT Web API Reference",
    "description": "",
    "version": "0.1.0"
  },
  "paths": {
    "/configurations": {
      "get": {
        "tags": [
          "Configurations"
        ],
        "summary": "Gets configuration IDs.",
        "operationId": "GetConfigurationIds",
        "responses": {
          "200": {
            "description": "The list of configuration IDs.",
            "content": {
              "text/plain": {
                "schema": {
                  "type": "array",
                  "items": {
                    "type": "string"
                  }
                }
              },
              "application/json": {
                "schema": {
                  "type": "array",
                  "items": {
                    "type": "string"
                  }
                }
              },
              "text/json": {
                "schema": {
                  "type": "array",
                  "items": {
                    "type": "string"
                  }
                }
              }
            }
          },
          "500": {
            "description": "The server error caused by unexpected application behavior.",
            "content": {
              "text/plain": {
                "schema": {
                  "type": "string"
                }
              },
              "application/json": {
                "schema": {
                  "type": "string"
                }
              },
              "text/json": {
                "schema": {
                  "type": "string"
                }
              }
            }
          }
        }
      }
    },
    "/configurations/{configurationId}": {
      "put": {
        "tags": [
          "Configurations"
        ],
        "summary": "Creates system configuration.",
        "operationId": "CreateConfiguration",
        "parameters": [
          {
            "name": "configurationId",
            "in": "path",
            "description": "The unique identification of configuration.",
            "required": true,
            "schema": {
              "type": "string",
              "description": "The unique identification of configuration.",
              "nullable": true
            }
          }
        ],
        "responses": {
          "200": {
            "description": "The configuration successfully created."
          },
          "500": {
            "description": "THe server error caused by unexpected application behavior.",
            "content": {
              "text/plain": {
                "schema": {
                  "type": "string"
                }
              },
              "application/json": {
                "schema": {
                  "type": "string"
                }
              },
              "text/json": {
                "schema": {
                  "type": "string"
                }
              }
            }
          }
        }
      },
      "delete": {
        "tags": [
          "Configurations"
        ],
        "summary": "Deletes system configuration.",
        "operationId": "RemoveConfiguration",
        "parameters": [
          {
            "name": "configurationId",
            "in": "path",
            "description": "The unique identification of configuration.",
            "required": true,
            "schema": {
              "type": "string",
              "description": "The unique identification of configuration.",
              "nullable": true
            }
          }
        ],
        "responses": {
          "200": {
            "description": "THe configuration successfully removed."
          },
          "404": {
            "description": "The configuration not found.",
            "content": {
              "text/plain": {
                "schema": {
                  "type": "string"
                }
              },
              "application/json": {
                "schema": {
                  "type": "string"
                }
              },
              "text/json": {
                "schema": {
                  "type": "string"
                }
              }
            }
          },
          "500": {
            "description": "The server error caused by unexpected application behavior.",
            "content": {
              "text/plain": {
                "schema": {
                  "type": "string"
                }
              },
              "application/json": {
                "schema": {
                  "type": "string"
                }
              },
              "text/json": {
                "schema": {
                  "type": "string"
                }
              }
            }
          }
        }
      }
    },
    "/configurations/{configurationId}/entities": {
      "get": {
        "tags": [
          "Configurations"
        ],
        "summary": "Gets entities IDs from specified system configuration.",
        "operationId": "GetEntities",
        "parameters": [
          {
            "name": "configurationId",
            "in": "path",
            "description": "The unique identification of configuration.",
            "required": true,
            "schema": {
              "type": "string",
              "description": "The unique identification of configuration.",
              "nullable": true
            }
          }
        ],
        "responses": {
          "200": {
            "description": "The list of entities IDs.",
            "content": {
              "text/plain": {
                "schema": {
                  "type": "array",
                  "items": {
                    "type": "string"
                  }
                }
              },
              "application/json": {
                "schema": {
                  "type": "array",
                  "items": {
                    "type": "string"
                  }
                }
              },
              "text/json": {
                "schema": {
                  "type": "array",
                  "items": {
                    "type": "string"
                  }
                }
              }
            }
          },
          "500": {
            "description": "The server error caused by unexpected application behavior.",
            "content": {
              "text/plain": {
                "schema": {
                  "type": "string"
                }
              },
              "application/json": {
                "schema": {
                  "type": "string"
                }
              },
              "text/json": {
                "schema": {
                  "type": "string"
                }
              }
            }
          },
          "404": {
            "description": "THe configuration not found."
          }
        }
      },
      "post": {
        "tags": [
          "Configurations"
        ],
        "summary": "Creates entity with specific ID to specific system configuration.",
        "operationId": "CreateEntity",
        "parameters": [
          {
            "name": "configurationId",
            "in": "path",
            "description": "The unique identification of configuration.",
            "required": true,
            "schema": {
              "type": "string",
              "description": "The unique identification of configuration.",
              "nullable": true
            }
          },
          {
            "name": "entityName",
            "in": "query",
            "description": "The name of the entity.",
            "required": true,
            "schema": {
              "type": "string",
              "description": "The name of the entity."
            }
          },
          {
            "name": "parentTransformId",
            "in": "query",
            "description": "The Id of parent. Use only if name of entity is not empty.",
            "schema": {
              "type": "string",
              "description": "The Id of parent. Use only if name of entity is not empty.",
              "nullable": true
            }
          }
        ],
        "responses": {
          "200": {
            "description": "The created entity.",
            "content": {
              "text/plain": {
                "schema": {
                  "$ref": "#/components/schemas/Entity"
                }
              },
              "application/json": {
                "schema": {
                  "$ref": "#/components/schemas/Entity"
                }
              },
              "text/json": {
                "schema": {
                  "$ref": "#/components/schemas/Entity"
                }
              }
            }
          },
          "400": {
            "description": "The entity creation constraints violated.",
            "content": {
              "text/plain": {
                "schema": {
                  "type": "string"
                }
              },
              "application/json": {
                "schema": {
                  "type": "string"
                }
              },
              "text/json": {
                "schema": {
                  "type": "string"
                }
              }
            }
          },
          "404": {
            "description": "The configuration not found.",
            "content": {
              "text/plain": {
                "schema": {
                  "type": "string"
                }
              },
              "application/json": {
                "schema": {
                  "type": "string"
                }
              },
              "text/json": {
                "schema": {
                  "type": "string"
                }
              }
            }
          },
          "500": {
            "description": "The server error caused by unexpected application behavior.",
            "content": {
              "text/plain": {
                "schema": {
                  "type": "string"
                }
              },
              "application/json": {
                "schema": {
                  "type": "string"
                }
              },
              "text/json": {
                "schema": {
                  "type": "string"
                }
              }
            }
          }
        }
      }
    },
    "/configurations/{configurationId}/entities/{entityId}": {
      "get": {
        "tags": [
          "Configurations"
        ],
        "summary": "Gets entity by ID from specific system configuration.",
        "operationId": "GetEntity",
        "parameters": [
          {
            "name": "configurationId",
            "in": "path",
            "description": "The unique identification of configuration.",
            "required": true,
            "schema": {
              "type": "string",
              "description": "The unique identification of configuration.",
              "nullable": true
            }
          },
          {
            "name": "entityId",
            "in": "path",
            "description": "The unique identification of the entity.",
            "required": true,
            "schema": {
              "type": "string",
              "description": "The unique identification of the entity.",
              "nullable": true
            }
          }
        ],
        "responses": {
          "200": {
            "description": "The requested Entity.",
            "content": {
              "text/plain": {
                "schema": {
                  "$ref": "#/components/schemas/Entity"
                }
              },
              "application/json": {
                "schema": {
                  "$ref": "#/components/schemas/Entity"
                }
              },
              "text/json": {
                "schema": {
                  "$ref": "#/components/schemas/Entity"
                }
              }
            }
          },
          "404": {
            "description": "The configuration not found.",
            "content": {
              "text/plain": {
                "schema": {
                  "type": "string"
                }
              },
              "application/json": {
                "schema": {
                  "type": "string"
                }
              },
              "text/json": {
                "schema": {
                  "type": "string"
                }
              }
            }
          },
          "500": {
            "description": "The server error caused by unexpected application behavior.",
            "content": {
              "text/plain": {
                "schema": {
                  "type": "string"
                }
              },
              "application/json": {
                "schema": {
                  "type": "string"
                }
              },
              "text/json": {
                "schema": {
                  "type": "string"
                }
              }
            }
          }
        }
      },
      "delete": {
        "tags": [
          "Configurations"
        ],
        "summary": "Removes entity by ID from specific system configuration.",
        "operationId": "RemoveEntity",
        "parameters": [
          {
            "name": "configurationId",
            "in": "path",
            "description": "The unique identification of configuration.",
            "required": true,
            "schema": {
              "type": "string",
              "description": "The unique identification of configuration.",
              "nullable": true
            }
          },
          {
            "name": "entityId",
            "in": "path",
            "description": "The unique identification of entity.",
            "required": true,
            "schema": {
              "type": "string",
              "description": "The unique identification of entity.",
              "nullable": true
            }
          }
        ],
        "responses": {
          "200": {
            "description": "The entity successfully removed."
          },
          "404": {
            "description": "The configuration not found.",
            "content": {
              "text/plain": {
                "schema": {
                  "type": "string"
                }
              },
              "application/json": {
                "schema": {
                  "type": "string"
                }
              },
              "text/json": {
                "schema": {
                  "type": "string"
                }
              }
            }
          },
          "500": {
            "description": "The server error caused by unexpected application behavior.",
            "content": {
              "text/plain": {
                "schema": {
                  "type": "string"
                }
              },
              "application/json": {
                "schema": {
                  "type": "string"
                }
              },
              "text/json": {
                "schema": {
                  "type": "string"
                }
              }
            }
          }
        }
      }
    },
    "/configurations/{configurationId}/components": {
      "post": {
        "tags": [
          "Configurations"
        ],
        "summary": "Creates component to specific system configuration.",
        "operationId": "CreateComponent",
        "parameters": [
          {
            "name": "configurationId",
            "in": "path",
            "description": "The unique identification of configuration.",
            "required": true,
            "schema": {
              "type": "string",
              "description": "The unique identification of configuration.",
              "nullable": true
            }
          },
          {
            "name": "entityId",
            "in": "query",
            "description": "The unique identification of entity.",
            "required": true,
            "schema": {
              "type": "string",
              "description": "The unique identification of entity."
            }
          },
          {
            "name": "componentTypeName",
            "in": "query",
            "description": "The name of the component type.",
            "required": true,
            "schema": {
              "type": "string",
              "description": "The name of the component type."
            }
          }
        ],
        "responses": {
          "200": {
            "description": "A serialized created component in a string.",
            "content": {
              "text/plain": {
                "schema": {
                  "type": "string"
                }
              },
              "application/json": {
                "schema": {
                  "type": "string"
                }
              },
              "text/json": {
                "schema": {
                  "type": "string"
                }
              }
            }
          },
          "400": {
            "description": "The component creation constraints violated.",
            "content": {
              "text/plain": {
                "schema": {
                  "type": "string"
                }
              },
              "application/json": {
                "schema": {
                  "type": "string"
                }
              },
              "text/json": {
                "schema": {
                  "type": "string"
                }
              }
            }
          },
          "404": {
            "description": "THe Configuration not found.",
            "content": {
              "text/plain": {
                "schema": {
                  "type": "string"
                }
              },
              "application/json": {
                "schema": {
                  "type": "string"
                }
              },
              "text/json": {
                "schema": {
                  "type": "string"
                }
              }
            }
          },
          "500": {
            "description": "The server error caused by unexpected application behavior.",
            "content": {
              "text/plain": {
                "schema": {
                  "type": "string"
                }
              },
              "application/json": {
                "schema": {
                  "type": "string"
                }
              },
              "text/json": {
                "schema": {
                  "type": "string"
                }
              }
            }
          }
        }
      },
      "put": {
        "tags": [
          "Configurations"
        ],
        "summary": "Updates component in specific system configuration.",
        "operationId": "UpdateComponent",
        "parameters": [
          {
            "name": "configurationId",
            "in": "path",
            "description": "The unique identification of configuration.",
            "required": true,
            "schema": {
              "type": "string",
              "description": "The unique identification of configuration.",
              "nullable": true
            }
          },
          {
            "name": "componentContent",
            "in": "query",
            "description": "The whole content of component to update.",
            "required": true,
            "schema": {
              "type": "string",
              "description": "The whole content of component to update."
            }
          },
          {
            "name": "componentTypeName",
            "in": "query",
            "description": "The type of the component.",
            "required": true,
            "schema": {
              "type": "string",
              "description": "The type of the component."
            }
          }
        ],
        "responses": {
          "200": {
            "description": "The component successfully updated."
          },
          "400": {
            "description": "The component creation constraints violated.",
            "content": {
              "text/plain": {
                "schema": {
                  "type": "string"
                }
              },
              "application/json": {
                "schema": {
                  "type": "string"
                }
              },
              "text/json": {
                "schema": {
                  "type": "string"
                }
              }
            }
          },
          "404": {
            "description": "The configuration not found.",
            "content": {
              "text/plain": {
                "schema": {
                  "type": "string"
                }
              },
              "application/json": {
                "schema": {
                  "type": "string"
                }
              },
              "text/json": {
                "schema": {
                  "type": "string"
                }
              }
            }
          },
          "500": {
            "description": "The server error caused by unexpected application behavior.",
            "content": {
              "text/plain": {
                "schema": {
                  "type": "string"
                }
              },
              "application/json": {
                "schema": {
                  "type": "string"
                }
              },
              "text/json": {
                "schema": {
                  "type": "string"
                }
              }
            }
          }
        }
      }
    },
    "/configurations/{configurationId}/components/{componentId}": {
      "get": {
        "tags": [
          "Configurations"
        ],
        "summary": "Gets component by id and type from specific system configuration.",
        "operationId": "GetComponent",
        "parameters": [
          {
            "name": "configurationId",
            "in": "path",
            "description": "The unique identification of configuration.",
            "required": true,
            "schema": {
              "type": "string",
              "description": "The unique identification of configuration.",
              "nullable": true
            }
          },
          {
            "name": "componentId",
            "in": "path",
            "description": "The unique identification of entity.",
            "required": true,
            "schema": {
              "type": "string",
              "description": "The unique identification of entity.",
              "nullable": true
            }
          },
          {
            "name": "componentTypeName",
            "in": "query",
            "description": "The name of the component type.",
            "required": true,
            "schema": {
              "type": "string",
              "description": "The name of the component type."
            }
          }
        ],
        "responses": {
          "200": {
            "description": "A serialized component in a string.",
            "content": {
              "text/plain": {
                "schema": {
                  "type": "string"
                }
              },
              "application/json": {
                "schema": {
                  "type": "string"
                }
              },
              "text/json": {
                "schema": {
                  "type": "string"
                }
              }
            }
          },
          "404": {
            "description": "The configuration not found.",
            "content": {
              "text/plain": {
                "schema": {
                  "type": "string"
                }
              },
              "application/json": {
                "schema": {
                  "type": "string"
                }
              },
              "text/json": {
                "schema": {
                  "type": "string"
                }
              }
            }
          },
          "500": {
            "description": "The server error caused by unexpected application behavior.",
            "content": {
              "text/plain": {
                "schema": {
                  "type": "string"
                }
              },
              "application/json": {
                "schema": {
                  "type": "string"
                }
              },
              "text/json": {
                "schema": {
                  "type": "string"
                }
              }
            }
          }
        }
      },
      "delete": {
        "tags": [
          "Configurations"
        ],
        "summary": "Removes component in specific system configuration.",
        "operationId": "RemoveComponent",
        "parameters": [
          {
            "name": "configurationId",
            "in": "path",
            "description": "The unique identification of configuration.",
            "required": true,
            "schema": {
              "type": "string",
              "description": "The unique identification of configuration.",
              "nullable": true
            }
          },
          {
            "name": "componentId",
            "in": "path",
            "description": "The unique identification of the component.",
            "required": true,
            "schema": {
              "type": "string",
              "description": "The unique identification of the component.",
              "nullable": true
            }
          }
        ],
        "responses": {
          "200": {
            "description": "The component successfully removed."
          },
          "404": {
            "description": "The configuration not found.",
            "content": {
              "text/plain": {
                "schema": {
                  "type": "string"
                }
              },
              "application/json": {
                "schema": {
                  "type": "string"
                }
              },
              "text/json": {
                "schema": {
                  "type": "string"
                }
              }
            }
          },
          "500": {
            "description": "The server error caused by unexpected application behavior.",
            "content": {
              "text/plain": {
                "schema": {
                  "type": "string"
                }
              },
              "application/json": {
                "schema": {
                  "type": "string"
                }
              },
              "text/json": {
                "schema": {
                  "type": "string"
                }
              }
            }
          }
        }
      }
    },
    "/configurations/{configurationId}/entities/{entityId}/component": {
      "get": {
        "tags": [
          "Configurations"
        ],
        "summary": "Gets component by entity id and type from specific system configuration.",
        "operationId": "GetEntityComponent",
        "parameters": [
          {
            "name": "configurationId",
            "in": "path",
            "description": "The unique identification of configuration.",
            "required": true,
            "schema": {
              "type": "string",
              "description": "The unique identification of configuration.",
              "nullable": true
            }
          },
          {
            "name": "entityId",
            "in": "path",
            "description": "The unique identification of entity.",
            "required": true,
            "schema": {
              "type": "string",
              "description": "The unique identification of entity.",
              "nullable": true
            }
          },
          {
            "name": "componentTypeName",
            "in": "query",
            "description": "The name of component type.",
            "required": true,
            "schema": {
              "type": "string",
              "description": "The name of component type."
            }
          }
        ],
        "responses": {
          "200": {
            "description": "A serialized component in a string.",
            "content": {
              "text/plain": {
                "schema": {
                  "type": "string"
                }
              },
              "application/json": {
                "schema": {
                  "type": "string"
                }
              },
              "text/json": {
                "schema": {
                  "type": "string"
                }
              }
            }
          },
          "404": {
            "description": "The configuration not found.",
            "content": {
              "text/plain": {
                "schema": {
                  "type": "string"
                }
              },
              "application/json": {
                "schema": {
                  "type": "string"
                }
              },
              "text/json": {
                "schema": {
                  "type": "string"
                }
              }
            }
          },
          "500": {
            "description": "The server error caused by unexpected application behavior.",
            "content": {
              "text/plain": {
                "schema": {
                  "type": "string"
                }
              },
              "application/json": {
                "schema": {
                  "type": "string"
                }
              },
              "text/json": {
                "schema": {
                  "type": "string"
                }
              }
            }
          }
        }
      }
    },
    "/configurations/{configurationId}/components/parent": {
      "put": {
        "tags": [
          "Configurations"
        ],
        "summary": "Setups parenthood between transforms in specific system configuration.",
        "operationId": "SetParent",
        "parameters": [
          {
            "name": "configurationId",
            "in": "path",
            "description": "The unique identification of configuration.",
            "required": true,
            "schema": {
              "type": "string",
              "description": "The unique identification of configuration.",
              "nullable": true
            }
          },
          {
            "name": "transformId",
            "in": "query",
            "description": "The unique identification of transform.",
            "required": true,
            "schema": {
              "type": "string",
              "description": "The unique identification of transform."
            }
          },
          {
            "name": "parentTransformId",
            "in": "query",
            "description": "The unique identification of parent's transform.",
            "required": true,
            "schema": {
              "type": "string",
              "description": "The unique identification of parent's transform."
            }
          }
        ],
        "responses": {
          "200": {
            "description": "The parenthood successfully set."
          },
          "404": {
            "description": "The configuration not found.",
            "content": {
              "text/plain": {
                "schema": {
                  "type": "string"
                }
              },
              "application/json": {
                "schema": {
                  "type": "string"
                }
              },
              "text/json": {
                "schema": {
                  "type": "string"
                }
              }
            }
          },
          "500": {
            "description": "The server error caused by unexpected application behavior.",
            "content": {
              "text/plain": {
                "schema": {
                  "type": "string"
                }
              },
              "application/json": {
                "schema": {
                  "type": "string"
                }
              },
              "text/json": {
                "schema": {
                  "type": "string"
                }
              }
            }
          }
        }
      }
    },
    "/system/set": {
      "put": {
        "tags": [
          "System"
        ],
        "summary": "Creates a system using the specified configuration",
        "operationId": "Create",
        "parameters": [
          {
            "name": "configurationId",
            "in": "query",
            "description": "The unique identification of configuration.",
            "schema": {
              "type": "string",
              "description": "The unique identification of configuration.",
              "nullable": true
            }
          },
          {
            "name": "id",
            "in": "query",
            "description": "The unique identification of the system.",
            "schema": {
              "type": "string",
              "description": "The unique identification of the system.",
              "nullable": true
            }
          },
          {
            "name": "parentId",
            "in": "query",
            "description": "The ID of the parent in scene hierarchy.",
            "schema": {
              "type": "string",
              "description": "The ID of the parent in scene hierarchy.",
              "nullable": true
            }
          }
        ],
        "requestBody": {
          "description": "The realtive pose of the system to its parent.",
          "content": {
            "application/json": {
              "schema": {
                "$ref": "#/components/schemas/Pose"
              }
            },
            "text/json": {
              "schema": {
                "$ref": "#/components/schemas/Pose"
              }
            },
            "application/*+json": {
              "schema": {
                "$ref": "#/components/schemas/Pose"
              }
            }
          }
        },
        "responses": {
          "200": {
            "description": "System successfully created."
          },
          "500": {
            "description": "Unexpected server error.",
            "content": {
              "text/plain": {
                "schema": {
                  "type": "string"
                }
              },
              "application/json": {
                "schema": {
                  "type": "string"
                }
              },
              "text/json": {
                "schema": {
                  "type": "string"
                }
              }
            }
          }
        }
      }
    },
    "/system/reset": {
      "put": {
        "tags": [
          "System"
        ],
        "summary": "Destroys the system (if exists).",
        "operationId": "Destroy",
        "responses": {
          "200": {
            "description": "System successfully destroyed."
          },
          "500": {
            "description": "Unexpected server error.",
            "content": {
              "text/plain": {
                "schema": {
                  "type": "string"
                }
              },
              "application/json": {
                "schema": {
                  "type": "string"
                }
              },
              "text/json": {
                "schema": {
                  "type": "string"
                }
              }
            }
          }
        }
      }
    },
    "/system/running": {
      "get": {
        "tags": [
          "System"
        ],
        "summary": "Gets the currently running system configuration ID.",
        "operationId": "GetActiveSystem",
        "responses": {
          "200": {
            "description": "The configuration ID, if the system is running, otherwise an empty\r\n            string.",
            "content": {
              "text/plain": {
                "schema": {
                  "type": "string"
                }
              },
              "application/json": {
                "schema": {
                  "type": "string"
                }
              },
              "text/json": {
                "schema": {
                  "type": "string"
                }
              }
            }
          }
        }
      }
    },
    "/tester/test": {
      "get": {
        "tags": [
          "Tester"
        ],
        "summary": "Tests a PCB in an ICT tester.",
        "operationId": "Test",
        "parameters": [
          {
            "name": "serialNumber",
            "in": "query",
            "schema": {
              "type": "string",
              "nullable": true
            }
          }
        ],
        "responses": {
          "200": {
            "description": "True if ICT tester is ready; otherwise, false.",
            "content": {
              "text/plain": {
                "schema": {
                  "type": "boolean"
                }
              },
              "application/json": {
                "schema": {
                  "type": "boolean"
                }
              },
              "text/json": {
                "schema": {
                  "type": "boolean"
                }
              }
            }
          },
          "520": {
            "description": "Any problem in communication with ICT tester."
          },
          "521": {
            "description": "The serial number is not valid for a given type of PCB."
          },
          "522": {
            "description": "Server Error"
          }
        }
      }
    },
    "/tester/ready": {
      "get": {
        "tags": [
          "Tester"
        ],
        "summary": "Determines whether the ICT Tester is open and ready to start testing.",
        "operationId": "Ready",
        "responses": {
          "200": {
            "description": "True if ICT tester is ready; otherwise, false.",
            "content": {
              "text/plain": {
                "schema": {
                  "type": "boolean"
                }
              },
              "application/json": {
                "schema": {
                  "type": "boolean"
                }
              },
              "text/json": {
                "schema": {
                  "type": "boolean"
                }
              }
            }
          },
          "520": {
            "description": "Problem in communication with ICT tester."
          }
        }
      }
    }
  },
  "components": {
    "schemas": {
      "ComponentSummary": {
        "type": "object",
        "properties": {
          "id": {
            "type": "string",
            "nullable": true
          },
          "type": {
            "type": "string",
            "nullable": true
          }
        },
        "additionalProperties": false
      },
      "Entity": {
        "type": "object",
        "properties": {
          "id": {
            "type": "string",
            "nullable": true
          },
          "name": {
            "type": "string",
            "nullable": true
          },
          "components": {
            "type": "array",
            "items": {
              "$ref": "#/components/schemas/ComponentSummary"
            },
            "nullable": true
          }
        },
        "additionalProperties": false
      },
      "Orientation": {
        "type": "object",
        "properties": {
          "w": {
            "type": "number",
            "format": "double"
          },
          "x": {
            "type": "number",
            "format": "double"
          },
          "y": {
            "type": "number",
            "format": "double"
          },
          "z": {
            "type": "number",
            "format": "double"
          }
        },
        "additionalProperties": false
      },
      "Position": {
        "type": "object",
        "properties": {
          "x": {
            "type": "number",
            "format": "double"
          },
          "y": {
            "type": "number",
            "format": "double"
          },
          "z": {
            "type": "number",
            "format": "double"
          }
        },
        "additionalProperties": false
      },
      "Pose": {
        "type": "object",
        "properties": {
          "orientation": {
            "$ref": "#/components/schemas/Orientation"
          },
          "position": {
            "$ref": "#/components/schemas/Position"
          }
        },
        "additionalProperties": false
      }
    }
  }
}