{
    "/assets/js/app.js": "/assets/js/app.js",
    "/assets/css/landing.css": "/assets/css/landing.css",
    "/assets/js/landing.js": "/assets/js/landing.js",
    "/assets/css/app.css": "/assets/css/app.css"
}
