<svg xmlns="http://www.w3.org/2000/svg" viewBox="0 0 51 8.024">
  <defs>
    <style>
      .cls-1, .cls-2 {
        fill: none;
        stroke: #fff;
        stroke-miterlimit: 10;
        stroke-width: 2px;
      }

      .cls-1 {
        stroke-linecap: round;
        stroke-linejoin: round;
      }
    </style>
  </defs>
  <g id="Group_41" data-name="Group 41" transform="translate(0 0.912)">
    <g id="Group_20" data-name="Group 20" transform="translate(41.551 0.5)">
      <path id="Path_29" data-name="Path 29" class="cls-1" d="M38.449,3.1,32.355,5.7,30,3.1,32.355.5Z" transform="translate(-30 -0.5)"/>
      <line id="Line_7" data-name="Line 7" class="cls-1" x1="2.355" y2="2.6"/>
      <line id="Line_8" data-name="Line 8" class="cls-1" x1="2.355" y1="2.6" transform="translate(0 2.6)"/>
    </g>
    <line id="Line_9" data-name="Line 9" class="cls-2" x2="41.551" transform="translate(0 3.1)"/>
  </g>
</svg>
