<svg xmlns="http://www.w3.org/2000/svg" viewBox="0 0 47 47">
  <defs>
    <style>
      .cls-1 {
        fill: none;
        stroke: #002b50;
        stroke-miterlimit: 10;
        stroke-width: 2px;
      }

      .cls-2 {
        fill: #002b50;
      }
    </style>
  </defs>
  <g id="Group_11" data-name="Group 11" transform="translate(0.5 0.5)">
    <path id="Path_14" data-name="Path 14" class="cls-1" d="M23,.5A22.5,22.5,0,1,0,45.5,23,22.534,22.534,0,0,0,23,.5Z"/>
    <g id="Group_10" data-name="Group 10" transform="translate(5.974 12.535)">
      <path id="Path_15" data-name="Path 15" class="cls-2" d="M40,13,32,26.5a.651.651,0,0,1-.9.2l-5.8-3.5a.653.653,0,0,1,0-1.1l14.3-9.5C39.8,12.4,40.1,12.7,40,13Z" transform="translate(-5.974 -12.535)"/>
      <path id="Path_16" data-name="Path 16" class="cls-2" d="M30.6,28.7l-5.9,10a1.97,1.97,0,0,1-3.4,0l-5.9-10L10,19.5,6,13a.308.308,0,0,1,.4-.4l8.5,5.7,8,5.3Z" transform="translate(-5.974 -12.535)"/>
      <path id="Path_17" data-name="Path 17" class="cls-2" d="M37,13.4,23,21.5a.854.854,0,0,1-.7,0L17,18.2c-.2-.1-.2-.4.1-.5l19.8-4.9A.331.331,0,0,1,37,13.4Z" transform="translate(-5.974 -12.535)"/>
    </g>
  </g>
</svg>
