id	submitter_id	entity_type	entity_id	category	classification	created_datetime	status	notes
f247d3ee-2366-550e-85e9-f62daee49eef	11719	case	4b606edf-07fc-4665-a7cd-a794004e5aca	Normal tissue origin incorrect	Notification	2012-10-31T00:00:00	Approved	Samples were created as tssDNA from Normal Tissue.  Actually are tssDNA extracted from Blood.  Should have been 10A instead of 11A.
cb0f491d-80ec-5b67-a415-13f85f212173	1697	analyte	8d5be18e-7317-4011-a852-177f6cfa6c76	Item is noncanonical	Notification	2011-03-14T00:00:00	Approved	Tumor Adjacent Normal
347d04d2-6be8-5a63-b8d5-a371632d622e	11906	case	69d0a566-5fbf-45f6-a240-649b06868e27	Qualified in error	Notification	2012-11-08T00:00:00	Approved	Subject qualified in error
bc5c5700-5249-5682-9a64-d0bbcaecb844	570	case	0164acd3-34db-4d35-b96c-936daad0ff22	Item in special subset	Notification	2010-07-30T00:00:00	Approved	[schaefc]: NECROSIS_STUDY
7c2cb829-ad1e-560f-8b94-b7a9323474c0	1592	analyte	5a9ce7ea-8415-4a14-a150-65cc0397e580	Item is noncanonical	Notification	2011-03-14T00:00:00	Approved	Necrosis Study
93df5cb0-7a4e-5cda-a278-073486b2015e	1593	analyte	5a9ce7ea-8415-4a14-a150-65cc0397e580	Item in special subset	Notification	2011-03-14T00:00:00	Approved	Necrosis Study
104d292a-9abe-53de-abfc-ec27790b2248	1597	analyte	08050169-fdfb-4bf7-9da5-0fe4204a785c	Item is noncanonical	Notification	2011-03-14T00:00:00	Approved	Tumor Adjacent Normal
c177acdf-bb2b-5fda-87fb-38a7fc8b0b18	1552	analyte	2668dd90-3e2e-42a8-98ed-7c2d82cfd56d	Item in special subset	Notification	2011-03-14T00:00:00	Approved	Portioning Study
2a20a846-d356-5a6e-ab02-b6fc73f6d8d6	621	case	872511fb-98cd-4fba-82f6-4c3689c75ae2	Molecular analysis outside specification	Notification	2010-09-15T00:00:00	Approved	[intgen.org]: Molecular Results off Spec
e92b7f1d-a5d8-520d-a5cf-697ad8a426e3	1530	analyte	9de7d6b2-5442-4a31-9b80-73bca4fac0fe	Item is noncanonical	Notification	2011-03-14T00:00:00	Approved	Tumor Adjacent Normal
76e0e2ff-ef5f-595a-b3bf-ef3a381dd13b	4723	analyte	4d86bc25-12a4-4d17-a858-f60dc8535a65	Item is noncanonical	Notification	2011-12-15T00:00:00	Approved	GBM Recurrent/Triplet
30e86097-e380-5031-9be1-a17b1c120247	11919	case	cd73f38a-f6ff-4e7b-bd43-ec7b82dbe7df	Case submitted is found to be a recurrence after submission	Notification	2012-11-10T00:00:00	Approved	Per enrollment form, patient had a prior diagnosis of a lower grade glioma.
a40b3a0f-b32f-518c-8072-24263be9f53e	697	portion	bfd417c5-c8f4-4759-a250-ee8f8aa57272	Tumor class but appears normal	Observation	2010-07-30T00:00:00	Approved	[schaefc]: Dx slide resembles normal tissue
59214645-20b1-5f1d-a0db-6f90a114c470	566	case	2cb9975f-2d1e-4c74-867f-8b151c22b246	Item in special subset	Notification	2010-07-30T00:00:00	Approved	[schaefc]: NECROSIS_STUDY
0e32f193-70a4-563c-93cf-6bf4e39a45a6	4715	analyte	0b0ce338-9e5f-4e8e-890d-71c31a28d8af	Item is noncanonical	Notification	2011-12-15T00:00:00	Approved	GBM Recurrent/Triplet
eef1f4d7-1f59-5a67-b051-9f3cbe0a9931	4705	analyte	13ab71eb-774d-41af-9274-be95e03e8b09	Item is noncanonical	Notification	2011-12-15T00:00:00	Approved	GBM Recurrent/Triplet
b20423f1-fecd-5dd9-9f03-07c3f71eacb6	1696	analyte	501b297f-8c36-4426-bd5f-c9b9767aeda0	Item is noncanonical	Notification	2011-03-14T00:00:00	Approved	Tumor Adjacent Normal
5a4dfb7f-59af-5cfe-abe1-acc3ac3a7fb4	1585	analyte	018966a4-712b-4921-a7e7-02e390f43288	Item in special subset	Notification	2011-03-14T00:00:00	Approved	Necrosis Study
a74160a6-4bf8-53b9-a5cc-7314ebf19f53	11926	case	f2de4316-026c-4c2d-b091-47bc0ec8612a	Case submitted is found to be a recurrence after submission	Notification	2012-11-10T00:00:00	Approved	Per enrollment form, patient had a prior diagnosis of a lower grade glioma.
82c4e0e4-aca5-5794-9bbd-0e5e98f75fdb	11913	case	5613f5f6-086d-470b-8f77-6dcb7f8625b7	Case submitted is found to be a recurrence after submission	Notification	2012-11-10T00:00:00	Approved	Per enrollment form, patient had a prior diagnosis of a lower grade glioma.
47f59b48-d71e-500a-bdfd-402338e7466d	1661	analyte	8874ac6f-b3c5-4a61-bf57-42928e789af0	Item in special subset	Notification	2011-03-14T00:00:00	Approved	Portioning Study
cd326b31-c20d-5d4b-a184-55f8134f0574	1571	analyte	f0e4a38b-697d-43ce-aa40-31f7a828ec8e	Item in special subset	Notification	2011-03-14T00:00:00	Approved	Portioning Study
546e3520-a4f2-50c8-91b0-c25cc66b8279	1570	analyte	f0e4a38b-697d-43ce-aa40-31f7a828ec8e	Item in special subset	Notification	2011-03-14T00:00:00	Approved	Necrosis Study
f242103b-73a0-5a0e-ac90-21a16cd81dc4	4707	analyte	f92fa42c-ad2a-4a6a-b1ab-c0db23ac51ce	Item is noncanonical	Notification	2011-12-15T00:00:00	Approved	GBM Recurrent/Triplet
7255d50a-17de-51f0-a466-d166f845dd30	826	case	a3cc2845-8a44-4b50-8a3e-17a3c2c3e077	Item may not meet study protocol	Observation	2010-10-28T00:00:00	Approved	Case identified (by Duke) as a secondary GBM; original annotation 06/22/09
de78c989-e74e-5ca3-a67a-66b02a9ccdf5	827	case	bb0aca6b-55ab-4b24-8e64-29e0c96a9862	Item may not meet study protocol	Observation	2010-10-28T00:00:00	Approved	Case identified (by Duke) as a secondary GBM; original annotation 06/22/09
4b4d1c46-6cc8-5cea-8ee2-35b57c881e96	1699	analyte	bf3e3123-0673-4dd9-9096-8111647c3ea0	Item is noncanonical	Notification	2011-03-14T00:00:00	Approved	Tumor Adjacent Normal
b34f2ab9-2db0-5957-826d-813046230188	638	case	d88b35a3-a291-457a-b15b-a314859b25c5	Neoadjuvant therapy	Notification	2010-09-02T00:00:00	Approved	[intgen.org]: Subject Positive for Neo-Adjuvant Therapy
4dae0ab9-74c3-58e6-a4f8-f77ab52bcf65	11933	case	e7d728e5-1a9f-4f27-9604-272e1235e08a	Case submitted is found to be a recurrence after submission	Notification	2012-11-10T00:00:00	Approved	Per enrollment form, patient had a prior diagnosis of a lower grade glioma.  Current TCGA tissue is reported as treated tissue.
ba0126d7-458f-54ab-a521-929ade55a0ce	11670	case	e7d728e5-1a9f-4f27-9604-272e1235e08a	Neoadjuvant therapy	Notification	2012-10-31T00:00:00	Approved	Per enrollment form, patient received neo-adjuvant therapy.
5177419a-de07-5ceb-ab22-6d0856dd5be9	1760	analyte	06c14955-1a5d-4e15-bfbf-be1509ee7369	Item in special subset	Notification	2011-03-14T00:00:00	Approved	Necrosis Study
a9329abb-f803-5c6c-816d-dac19de1975d	691	case	53abce1d-7e33-4ebd-832f-f3789f67377f	Normal class but appears diseased	Observation	2010-07-30T00:00:00	Approved	[schaefc]: Genomic data resembles tumor data
bb6f5b0d-89ea-5aa1-be31-4af2c9fd9ead	11934	case	5438322c-9db0-4974-ba01-801020559f97	Case submitted is found to be a recurrence after submission	Notification	2012-11-10T00:00:00	Approved	Per enrollment form, patient had a prior diagnosis of a lower grade glioma.  Current TCGA tissue is reported as treated tissue.
18f4d636-9bba-5fd1-ac64-22ea88b5f130	18708	analyte	0ff5d286-e53d-484e-9400-415687d729b7	General	Observation	2013-11-19T00:00:00	Approved	DNA analyte UUID: 0FF5D286-E53D-484E-9400-415687D729B7 was involved in an extraction protocol deviation wherein isopropanol precipitation was used as a means of buffer exchange on the column-eluted analyte.
fe6585f4-e39d-53b8-a985-0707626cc4bc	571	case	c57d6674-08d1-4eda-9ec1-ae439923d7cf	Item in special subset	Notification	2010-07-30T00:00:00	Approved	[schaefc]: NECROSIS_STUDY
fddb98f4-f268-572f-bfbc-023f34dc446f	829	case	e57b296a-80e9-4446-a3d1-3dbfeaf04f5e	Item may not meet study protocol	Observation	2010-10-28T00:00:00	Approved	Case identified (by Duke) as a secondary GBM; original annotation 06/22/09
9fa76b4d-8c47-5379-b641-f68bf02cf2cf	11932	case	c29d73c0-c885-4105-bf74-38e9178e71c9	Case submitted is found to be a recurrence after submission	Notification	2012-11-10T00:00:00	Approved	Per enrollment form, patient had a prior diagnosis of a lower grade glioma.
7ab2528f-a083-55bb-bc15-7c3bc7154dc8	1694	analyte	e5e02cc7-d5c9-46cd-a011-57e15099f7c8	Item is noncanonical	Notification	2011-03-14T00:00:00	Approved	Tumor Adjacent Normal
cf45f352-8abe-539e-b494-accaedcffbc4	4728	analyte	cd3a31a0-26f3-4a11-aa53-151b62d0fe0b	Item is noncanonical	Notification	2011-12-15T00:00:00	Approved	GBM Triplet
cb6e1a1b-a932-573e-9a96-6a36be3cf742	3176	case	da5f6940-e8ee-4fd1-a8da-4cd68e02e59c	Neoadjuvant therapy	Notification	2011-07-27T00:00:00	Approved	Subject positive for neoadjuvant therapy.
9f0f575d-4d92-5a85-b3e7-8693dbe7f3a2	4730	analyte	046fe484-5563-446f-99cc-5f9a4a56577c	Item is noncanonical	Notification	2011-12-15T00:00:00	Approved	GBM Triplet
b52340b3-b1c5-5ace-bea2-88cfe7f84723	2700	case	4c42dc4e-66b7-40bf-9fbe-b92543248198	Pathology outside specification	Notification	2011-05-15T00:00:00	Approved	[intgen.org]: Pathology Results off Spec
f5ca9e6c-01f5-5884-a392-9928e6344651	1769	analyte	fbe5d5b9-ea80-4ead-9100-daf2b66377b5	Item in special subset	Notification	2011-03-14T00:00:00	Approved	Necrosis Study
058a03b7-3599-5b25-8a8f-f538efceebfb	830	case	025a7401-a65d-4ea0-8b4e-0ba775b0322a	Item may not meet study protocol	Observation	2010-10-28T00:00:00	Approved	Case identified (by Duke) as a secondary GBM; original annotation 06/22/14
2f2c33ff-60dd-560e-b4df-d2cf3ac7d562	830	case	025a7401-a65d-4ea0-8b4e-0ba775b0322a	Item may not meet study protocol	Observation	2010-10-28T00:00:00	Approved	Case identified (by Duke) as a secondary GBM; original annotation 06/22/09
fac8990a-6287-5c46-a833-460c15ad4d05	1541	analyte	38d4497c-a4b7-4858-a42a-cc613b43ebfc	Item is noncanonical	Notification	2011-03-14T00:00:00	Approved	Necrosis Study
d3b2beab-84fe-58a0-854e-7cd1129e23aa	1542	analyte	38d4497c-a4b7-4858-a42a-cc613b43ebfc	Item in special subset	Notification	2011-03-14T00:00:00	Approved	Necrosis Study
b23c8fc7-88b6-57eb-baad-dfda784eddb9	4719	analyte	2728a1bb-6c63-4893-9c49-3bd6ee2b9cb1	Item is noncanonical	Notification	2011-12-15T00:00:00	Approved	GBM Recurrent/Triplet
2fdeee39-0e56-5d73-a6f8-dd3b01edb45a	4703	analyte	74e53350-e588-4f8a-816e-67984adca9b5	Item is noncanonical	Notification	2011-12-15T00:00:00	Approved	GBM Recurrent/Triplet
c3b0f6f3-6575-583f-b9b2-aa24f9e9e4ea	679	case	d0de6676-6ba1-4d79-a9b0-ec3f1e8a8775	Qualified in error	Notification	2010-09-02T00:00:00	Approved	[intgen.org]: Qualified in Error - Decommissioned
f5304469-29d8-57e9-b5e3-a8743eba61df	568	case	d0de6676-6ba1-4d79-a9b0-ec3f1e8a8775	Item in special subset	Notification	2010-07-30T00:00:00	Approved	[schaefc]: NECROSIS_STUDY
f1fd3cb6-094e-5502-80a0-47b5cc3a0ac3	5005	case	a795a841-9fd6-4eac-b871-a8c70248700f	Prior malignancy	Notification	2012-02-24T00:00:00	Approved	Prior malignancy with systemic treatment
c5a00bd8-56d6-5d9c-ba95-c263e689e162	618	case	a795a841-9fd6-4eac-b871-a8c70248700f	Molecular analysis outside specification	Notification	2010-09-02T00:00:00	Approved	[intgen.org]: Molecular Results off Spec
64e055b1-fa05-55f4-a40c-2bfdd992857f	11912	case	a795a841-9fd6-4eac-b871-a8c70248700f	History of unacceptable prior treatment related to a prior/other malignancy	Notification	2012-11-10T00:00:00	Approved	Prior malignancy with systemic Treatment and locoregional radiation
a2ff2870-96fb-5d70-a18c-f3105e447896	1653	analyte	0049f446-9d53-4bdc-9ca7-60ed9e2d86e2	Item in special subset	Notification	2011-03-14T00:00:00	Approved	Necrosis Study
f9f49c67-fb26-5791-a9ff-0c7d22ce3de5	1652	analyte	0049f446-9d53-4bdc-9ca7-60ed9e2d86e2	Item is noncanonical	Notification	2011-03-14T00:00:00	Approved	Necrosis Study
5d680897-6640-5df4-898b-600e06b3d5d8	1659	analyte	8bbc6177-cb2a-4190-9de3-268ce77aa0dd	Item in special subset	Notification	2011-03-14T00:00:00	Approved	Necrosis Study
8d4fa5f1-270c-5967-a2e4-0c96b5d03d6a	1658	analyte	8bbc6177-cb2a-4190-9de3-268ce77aa0dd	Item is noncanonical	Notification	2011-03-14T00:00:00	Approved	Necrosis Study
0d808699-ade1-50a6-9fa4-2fd50b9a0399	1587	analyte	b05e1f5d-e731-4204-b544-9a6cfa93f325	Item in special subset	Notification	2011-03-14T00:00:00	Approved	Necrosis Study
51fd5755-6c0e-5330-90bb-0b031bef60d8	1586	analyte	b05e1f5d-e731-4204-b544-9a6cfa93f325	Item is noncanonical	Notification	2011-03-14T00:00:00	Approved	Necrosis Study
8bfc7ed2-f808-5d29-93e2-caf02fc3fceb	1534	analyte	6889fa03-3a22-4950-8e92-a0fab215a993	Item is noncanonical	Notification	2011-03-14T00:00:00	Approved	Tumor Adjacent Normal
c900d2d6-4077-5b1f-9882-101435d79bba	1707	analyte	35f8e2c9-985d-4c30-b8d3-274d26eeabbb	Item in special subset	Notification	2011-03-14T00:00:00	Approved	Portioning Study
759c302d-b112-54c9-b3e2-79a2015a75b3	11669	case	aa703529-7153-4f74-8577-2601876e3374	Normal tissue origin incorrect	Notification	2012-10-31T00:00:00	Approved	Samples were created as tssDNA from Normal Tissue.  Actually are tssDNA extracted from Blood.  Should have been 10A instead of 11A.
34b79065-2f30-56da-b372-f57a9aa03b8f	4709	analyte	8b832bd1-f7c6-4096-810a-c57832cf479c	Item is noncanonical	Notification	2011-12-15T00:00:00	Approved	GBM Recurrent/Triplet
ac5140c7-12fd-57fd-a75d-46c6f02572b1	4717	analyte	d49b5d99-84a5-4fd3-8077-cd5f92ab63d3	Item is noncanonical	Notification	2011-12-15T00:00:00	Approved	GBM Recurrent/Triplet
40db17f0-c2c3-509f-b11f-35cb461bd709	23677	case	7a4c0a14-ac97-4c2b-a9cc-68cb561b2494	History of unacceptable prior treatment related to a prior/other malignancy	Notification	2014-11-18T00:00:00	Approved	Patient had prior breast malignancy with systemic radiation
c0ae8038-8eb5-5233-978c-85b56f3c0689	5006	case	7a4c0a14-ac97-4c2b-a9cc-68cb561b2494	Prior malignancy	Notification	2012-03-09T00:00:00	Approved	Prior Breast Cancer as per pathology report treatment not specified.
01e0d7d4-55c7-5d8e-b428-4e6f89a8a573	1667	analyte	0d7a0fb7-9b09-4f95-8257-d0c0f7c959b2	Item in special subset	Notification	2011-03-14T00:00:00	Approved	Portioning Study
15a4e0ef-f926-54db-ad0a-b909b1c1e934	29662	case	6fc6b9ca-84d8-4647-bbc8-c5ab472b1c02	Item may not meet study protocol	Observation	2015-10-09T00:00:00	Approved	Pt treated with oxcarbazepine 11 days prior to procurement. According to the NIH, this drug is an anticonvulsant to treat seizures.
93d9d0fa-e589-50a0-9574-4f5c7a9bd79c	11921	case	827453a9-7388-4336-9ac5-4defcb904607	Case submitted is found to be a recurrence after submission	Notification	2012-11-10T00:00:00	Approved	Per enrollment form, patient had a prior diagnosis of a lower grade glioma.
2072483e-e143-53d3-b5fb-8a552bd8c655	3178	case	06c427a1-8c2d-4003-b744-139114a04440	Neoadjuvant therapy	Notification	2011-07-27T00:00:00	Approved	Subject positive for neoadjuvant therapy.
52c99b7a-22ed-527e-b2e0-374cfca117fa	1536	analyte	558557e0-392a-45ce-a2c6-52ac8dbea8c7	Item in special subset	Notification	2011-03-14T00:00:00	Approved	Necrosis Study
e12bf3c1-d38b-5df2-ac6e-457e2bb55340	1535	analyte	558557e0-392a-45ce-a2c6-52ac8dbea8c7	Item is noncanonical	Notification	2011-03-14T00:00:00	Approved	Necrosis Study
02f9b631-dd0e-560b-8418-280366c73bc0	4727	analyte	b40e7dfb-d32f-4750-81a9-80668586890d	Item is noncanonical	Notification	2011-12-15T00:00:00	Approved	GBM Triplet
0ea0377c-fec4-559f-a90e-e2986c3c740f	1629	analyte	0550bba3-e5c2-4de6-b37a-1d9e1e4ba08c	Item in special subset	Notification	2011-03-14T00:00:00	Approved	Portioning Study
e653931b-296b-5b45-9dc7-8564d042c4fe	5007	case	2c5fa2d4-8e35-42e4-8bca-9fb3371a19c8	Prior malignancy	Notification	2012-03-09T00:00:00	Approved	Prior Prostate malignancy as per pathology report.
f316d2b9-a90f-5796-b2d1-b6b1bb411515	3384	case	9348e446-0e43-4210-b07e-c534980cbf62	Item in special subset	Notification	2011-09-18T00:00:00	Approved	Case came in as GBM.  BCR was notified that case was LGG.  Program Office determined this will be a Notification vs. a Redaction
092b46fd-2308-5518-85ba-31ed7a873ba2	1594	analyte	f764aafc-631e-49f7-806d-5507bc4d49a1	Item is noncanonical	Notification	2011-03-14T00:00:00	Approved	Tumor Adjacent Normal
4191d541-e55a-5f74-aba5-a11a2f868438	11905	case	e1481049-c04e-48fe-8110-ac1d0ee86e75	Qualified in error	Notification	2012-11-08T00:00:00	Approved	Subject qualified in error
73f12fc6-dbe0-5f97-853b-22f28065732e	1533	analyte	9d57357f-a770-40fb-86bb-23a083ebd6c3	Item is noncanonical	Notification	2011-03-14T00:00:00	Approved	Tumor Adjacent Normal
e5312bbe-42ca-5e45-be2d-9e97e4dab279	1771	analyte	f8534274-0861-422f-8697-9572be606b3f	Item in special subset	Notification	2011-03-14T00:00:00	Approved	Portioning Study
0b635743-4dd8-54d3-824a-89d8d7458f1f	11661	case	e948d951-9299-4dec-9772-60b4ac3569cb	Neoadjuvant therapy	Notification	2012-10-31T00:00:00	Approved	Per enrollment form, patient received neo-adjuvant therapy.
bc78bd01-4e27-5f74-a72d-e90f7a5dd6eb	29661	case	737b35e1-d668-4fce-9b6e-76946c7952b6	Item may not meet study protocol	Observation	2015-10-09T00:00:00	Approved	Pt treated with dexmethasone and phenytoin sodium 6 days prior to procurement. According to the NIH, dexmethasone is an ancillary or hormone drug; SEER lists phenytoin sodium as an anticonvulsant to treat seizures.
7cb15fe3-09fa-54b0-8c33-619e1640e824	1762	analyte	f37b3486-b71d-4a2f-9e53-96ecd11eff98	Item in special subset	Notification	2011-03-14T00:00:00	Approved	Portioning Study
b1bd40a8-b47b-58f1-823c-0d4da5e8eb4a	5008	case	3dddfc44-7bb1-4974-8a65-a84fd4bac484	Prior malignancy	Notification	2012-03-09T00:00:00	Approved	Prior Prostate malignancy as per pathology report treatment not specified.
de83c215-4eb5-59da-b3b0-79a96f6f2259	11718	case	60e69f41-571e-4a1b-ae75-9d49eed620ca	Normal tissue origin incorrect	Notification	2012-10-31T00:00:00	Approved	Samples were created as tssDNA from Normal Tissue.  Actually are tssDNA extracted from Blood.  Should have been 10A instead of 11A.
79e4385a-73da-5b77-b973-dba10a2f96fc	4725	analyte	8653c279-c5ce-4224-b2e5-7e508567e1ff	Item is noncanonical	Notification	2011-12-15T00:00:00	Approved	GBM Recurrent/Triplet
86030eb8-0a57-54b1-92b4-b8bce82ca7e5	5009	case	6c28f086-6a25-40b6-93eb-bba0014acda6	Prior malignancy	Notification	2012-03-09T00:00:00	Approved	Prior Prostate malignancy as per pathology report.
b9ad4785-a9ad-5a49-a69f-8060ea04179e	11917	case	a515cf2d-e918-4958-9bf6-e611b425a97e	Case submitted is found to be a recurrence after submission	Notification	2012-11-10T00:00:00	Approved	Per enrollment form, patient had a prior diagnosis of a lower grade glioma.
3471eb24-e05e-59eb-b2c8-bee7fb95224a	825	case	141a1ef1-9be6-46d1-b445-305b222727d2	Item may not meet study protocol	Observation	2010-10-28T00:00:00	Approved	Case identified (by Duke) as a secondary GBM; original annotation 06/22/09
bef0cb94-ca90-5b58-98d3-9bf97aa8df6b	11927	case	13b4d676-ee9b-499b-94bb-2365830fb37e	Case submitted is found to be a recurrence after submission	Notification	2012-11-10T00:00:00	Approved	Per enrollment form, patient had a prior diagnosis of a lower grade glioma.