%!PS-Adobe-3.0 EPSF-3.0
%%DocumentNeededResources: font Helvetica
%%+ font Helvetica-Bold
%%+ font Helvetica-Oblique
%%+ font Helvetica-BoldOblique
%%+ font Symbol
%%Title: R Graphics Output
%%Creator: R Software
%%Pages: (atend)
%%BoundingBox: 0 0 576 432
%%EndComments
%%BeginProlog
/bp  { gs sRGB gs } def
% begin .ps.prolog
/gs  { gsave } bind def
/gr  { grestore } bind def
/ep  { showpage gr gr } bind def
/m   { moveto } bind def
/l  { rlineto } bind def
/np  { newpath } bind def
/cp  { closepath } bind def
/f   { fill } bind def
/o   { stroke } bind def
/c   { newpath 0 360 arc } bind def
/r   { 4 2 roll moveto 1 copy 3 -1 roll exch 0 exch rlineto 0 rlineto -1 mul 0 exch rlineto closepath } bind def
/p1  { stroke } bind def
/p2  { gsave bg fill grestore newpath } bind def
/p3  { gsave bg fill grestore stroke } bind def
/p6  { gsave bg eofill grestore newpath } bind def
/p7  { gsave bg eofill grestore stroke } bind def
/t   { 5 -2 roll moveto gsave rotate
       1 index stringwidth pop
       mul neg 0 rmoveto show grestore } bind def
/ta  { 4 -2 roll moveto gsave rotate show } bind def
/tb  { 2 -1 roll 0 rmoveto show } bind def
/cl  { grestore gsave newpath 3 index 3 index moveto 1 index
       4 -1 roll lineto  exch 1 index lineto lineto
       closepath clip newpath } bind def
/rgb { setrgbcolor } bind def
/s   { scalefont setfont } bind def
% end   .ps.prolog
/sRGB { [ /CIEBasedABC
          << /DecodeLMN
               [ { dup 0.03928 le
                        {12.92321 div}
                        {0.055 add 1.055 div 2.4 exp }
                     ifelse
                 } bind dup dup
               ]
             /MatrixLMN [0.412457 0.212673 0.019334
                         0.357576 0.715152 0.119192
                         0.180437 0.072175 0.950301]
             /WhitePoint [0.9505 1.0 1.0890]
           >>
         ] setcolorspace } bind def
/srgb { setcolor } bind def
%%IncludeResource: font Helvetica
/Helvetica findfont
dup length dict begin
  {1 index /FID ne {def} {pop pop} ifelse} forall
  /Encoding ISOLatin1Encoding def
  currentdict
  end
/Font1 exch definefont pop
%%IncludeResource: font Helvetica-Bold
/Helvetica-Bold findfont
dup length dict begin
  {1 index /FID ne {def} {pop pop} ifelse} forall
  /Encoding ISOLatin1Encoding def
  currentdict
  end
/Font2 exch definefont pop
%%IncludeResource: font Helvetica-Oblique
/Helvetica-Oblique findfont
dup length dict begin
  {1 index /FID ne {def} {pop pop} ifelse} forall
  /Encoding ISOLatin1Encoding def
  currentdict
  end
/Font3 exch definefont pop
%%IncludeResource: font Helvetica-BoldOblique
/Helvetica-BoldOblique findfont
dup length dict begin
  {1 index /FID ne {def} {pop pop} ifelse} forall
  /Encoding ISOLatin1Encoding def
  currentdict
  end
/Font4 exch definefont pop
%%IncludeResource: font Symbol
/Symbol findfont
dup length dict begin
  {1 index /FID ne {def} {pop pop} ifelse} forall
  currentdict
  end
/Font5 exch definefont pop
%%EndProlog
%%Page: 1 1
bp
59.04 73.44 545.76 372.96 cl
0.2745 0.5098 0.7059 srgb
1.12 setlinewidth
[ 3.38 5.62] 0 setdash
1 setlinecap
1 setlinejoin
10.00 setmiterlimit
np
76.78 361.87 m
0.85 0 l
0.56 0 l
0.29 0 l
0.28 0 l
0.28 0 l
0.85 0 l
0.28 0 l
0.84 0 l
2.26 0 l
0.28 0 l
1.13 0 l
0.28 0 l
0.28 0 l
0.85 0 l
0.28 0 l
0.28 0 l
0.28 0 l
0.28 0 l
1.13 0 l
0.28 0 l
1.41 0 l
0.85 0 l
1.12 0 l
1.70 0 l
0.56 0 l
1.13 0 l
0.28 0 l
0.28 0 l
0.85 0 l
1.40 0 l
0.29 -0.04 l
0.84 0 l
0.57 0 l
0.28 0 l
0.84 0 l
2.26 0 l
0.28 0 l
0.56 0 l
0.29 0 l
0.28 0 l
2.53 0 l
0.29 0 l
0.56 0 l
0.28 -0.02 l
0.28 0 l
0.28 0 l
1.41 0 l
1.41 0 l
2.54 0 l
0.56 0 l
0.29 0 l
0.56 0 l
0.84 0 l
0.29 0 l
0.56 0 l
0.56 0 l
0.29 0 l
0.28 0 l
0.56 0 l
0.28 0 l
0.57 0 l
0.28 0 l
1.97 0 l
0.85 0 l
0.28 0 l
0.28 0 l
3.10 0 l
0.56 0 l
0.85 0 l
1.13 0 l
2.53 0 l
1.98 0 l
0.56 0 l
0.85 0 l
1.69 0 l
0.28 0 l
2.82 0 l
0.56 0 l
1.41 0 l
1.13 0 l
0.28 0 l
0.28 0 l
0.85 0 l
1.12 0 l
2.82 0 l
2.54 0 l
2.54 0 l
0.84 0 l
0.28 0 l
0.85 0 l
0.28 0 l
0.56 0 l
1.13 0 l
0.28 0 l
0.85 0 l
1.13 0 l
2.25 0 l
3.10 0 l
0.85 0 l
166.97 361.81 lineto
0.85 0 l
1.13 -0.94 l
0.28 0 l
1.41 0 l
2.54 0 l
0.28 0 l
0.84 0 l
1.13 0 l
0.28 0 l
1.69 0 l
0.28 0 l
0.29 0 l
0.28 0 l
1.13 0 l
2.25 0 l
1.69 0 l
1.41 0 l
0.56 0 l
0.29 0 l
0.84 0 l
1.13 0 l
0.28 0 l
0.56 0 l
0.85 0 l
4.23 0 l
1.41 0 l
1.97 0 l
0.28 0 l
1.41 0 l
4.51 0 l
1.69 -0.31 l
0.28 -0.21 l
0.57 0 l
3.10 0 l
1.69 0 l
1.13 0 l
0.56 0 l
1.41 0 l
2.25 0 l
2.26 -0.98 l
0.28 0 l
1.69 0 l
1.97 0 l
4.80 0 l
2.53 -8.10 l
0.57 0 l
1.40 -10.45 l
1.98 0 l
0.56 0 l
1.41 0 l
1.41 0 l
0.85 -0.31 l
2.53 0 l
2.26 0 l
1.69 0 l
0.56 0 l
8.74 0 l
1.69 -0.32 l
1.41 0 l
0.28 -0.10 l
1.69 0 l
1.13 0 l
2.82 -0.16 l
2.25 0 l
3.67 0 l
3.38 -6.59 l
2.25 0 l
0.85 0 l
0.28 0 l
3.95 0 l
4.79 0 l
5.35 0 l
0.28 0 l
4.23 0 l
0.85 0 l
3.38 0 l
1.69 0 l
3.10 0 l
3.95 -0.31 l
14.37 0 l
3.95 -1.72 l
0.84 0 l
29.88 -73.64 l
5.35 0 l
11.84 0 l
31.28 -21.37 l
5.08 -89.24 l
13.81 -0.21 l
23.39 -8.17 l
1.13 0 l
40.30 0 l
88.29 0 l
o
0.00 0.00 576.00 432.00 cl
0 0 0 srgb
0.75 setlinewidth
[] 0 setdash
1 setlinecap
1 setlinejoin
10.00 setmiterlimit
np
76.78 73.44 m
422.77 0 l
o
np
76.78 73.44 m
0 -7.20 l
o
np
217.71 73.44 m
0 -7.20 l
o
np
358.63 73.44 m
0 -7.20 l
o
np
499.55 73.44 m
0 -7.20 l
o
/Font1 findfont 12 s
76.78 47.52 (0) .5 0 t
217.71 47.52 (500) .5 0 t
358.63 47.52 (1000) .5 0 t
499.55 47.52 (1500) .5 0 t
np
59.04 111.98 m
0 249.89 l
o
np
59.04 111.98 m
-7.20 0 l
o
np
59.04 174.45 m
-7.20 0 l
o
np
59.04 236.92 m
-7.20 0 l
o
np
59.04 299.39 m
-7.20 0 l
o
np
59.04 361.87 m
-7.20 0 l
o
41.76 111.98 (0.2) .5 90 t
41.76 174.45 (0.4) .5 90 t
41.76 236.92 (0.6) .5 90 t
41.76 299.39 (0.8) .5 90 t
41.76 361.87 (1.0) .5 90 t
np
59.04 73.44 m
486.72 0 l
0 299.52 l
-486.72 0 l
0 -299.52 l
o
0.00 0.00 576.00 432.00 cl
/Font1 findfont 12 s
0 0 0 srgb
270.73 18.72 (Time \(da) 0 ta
-0.360 (ys\)) tb gr
12.96 172.19 (Sur) 90 ta
0.360 (viv) tb
-0.300 (al Probability) tb gr
59.04 73.44 545.76 372.96 cl
0.2745 0.5098 0.7059 srgb
1.12 setlinewidth
[ 3.38 5.62] 0 setdash
1 setlinecap
1 setlinejoin
10.00 setmiterlimit
np
76.78 361.87 m
0.85 -1.37 l
0.56 0 l
0.29 0 l
0.28 0 l
0.28 0 l
0.85 0 l
0.28 0 l
0.84 0 l
2.26 0 l
0.28 0 l
1.13 0 l
0.28 0 l
0.28 0 l
0.85 0 l
0.28 0 l
0.28 0 l
0.28 0 l
0.28 0 l
1.13 0 l
0.28 0 l
1.41 0 l
0.85 -0.11 l
1.12 0 l
1.70 0 l
0.56 0 l
1.13 0 l
0.28 0 l
0.28 0 l
0.85 0 l
1.40 0 l
0.29 -0.59 l
0.84 0 l
0.57 0 l
0.28 -26.02 l
0.84 0 l
2.26 0 l
0.28 0 l
0.56 0 l
0.29 0 l
0.28 0 l
2.53 0 l
0.29 0 l
0.56 0 l
0.28 0 l
0.28 0 l
0.28 0 l
1.41 0 l
1.41 0 l
2.54 0 l
0.56 0 l
0.29 0 l
0.56 0 l
0.84 0 l
0.29 0 l
0.56 0 l
0.56 0 l
0.29 0 l
0.28 0 l
0.56 -1.89 l
0.28 0 l
0.57 0 l
0.28 -22.34 l
1.97 0 l
0.85 0 l
0.28 0 l
0.28 0 l
3.10 0 l
0.56 0 l
0.85 0 l
1.13 0 l
2.53 0 l
1.98 0 l
0.56 0 l
0.85 0 l
1.69 0 l
0.28 0 l
2.82 -1.90 l
0.56 -2.31 l
1.41 0 l
1.13 0 l
0.28 0 l
0.28 0 l
0.85 0 l
1.12 0 l
2.82 0 l
2.54 0 l
2.54 -15.22 l
0.84 0 l
0.28 0 l
0.85 0 l
0.28 0 l
0.56 0 l
1.13 0 l
0.28 0 l
0.85 0 l
1.13 0 l
2.25 0 l
3.10 0 l
0.85 -16.89 l
166.97 273.23 lineto
0.85 0 l
1.13 -0.62 l
0.28 0 l
1.41 0 l
2.54 0 l
0.28 0 l
0.84 0 l
1.13 0 l
0.28 0 l
1.69 0 l
0.28 0 l
0.29 0 l
0.28 -0.23 l
1.13 0 l
2.25 0 l
1.69 0 l
1.41 0 l
0.56 0 l
0.29 0 l
0.84 0 l
1.13 0 l
0.28 0 l
0.56 0 l
0.85 0 l
4.23 0 l
1.41 0 l
1.97 0 l
0.28 0 l
1.41 0 l
4.51 0 l
1.69 0 l
0.28 -0.25 l
0.57 0 l
3.10 0 l
1.69 0 l
1.13 0 l
0.56 0 l
1.41 -0.08 l
2.25 0 l
2.26 0 l
0.28 0 l
1.69 0 l
1.97 -0.18 l
4.80 0 l
2.53 0 l
0.57 0 l
1.40 0 l
1.98 0 l
0.56 -0.32 l
1.41 0 l
1.41 0 l
0.85 0 l
2.53 0 l
2.26 0 l
1.69 0 l
0.56 0 l
8.74 0 l
1.69 0 l
1.41 0 l
0.28 -0.15 l
1.69 0 l
1.13 0 l
2.82 -3.82 l
2.25 -1.87 l
3.67 -0.31 l
3.38 -0.21 l
2.25 0 l
0.85 0 l
0.28 -0.94 l
3.95 -0.08 l
4.79 0 l
5.35 0 l
0.28 0 l
4.23 0 l
0.85 -0.06 l
3.38 0 l
1.69 0 l
3.10 0 l
3.95 -3.13 l
14.37 -6.02 l
3.95 -1.72 l
0.84 -0.62 l
29.88 -3.28 l
5.35 -7.91 l
11.84 0 l
31.28 -25.33 l
5.08 -6.06 l
13.81 -23.98 l
23.39 -8.11 l
1.13 0 l
40.30 0 l
88.29 -0.53 l
o
np
76.78 361.87 m
0.85 0 l
0.56 0 l
0.29 0 l
0.28 0 l
0.28 0 l
0.85 0 l
0.28 0 l
0.84 0 l
2.26 0 l
0.28 0 l
1.13 0 l
0.28 0 l
0.28 0 l
0.85 0 l
0.28 0 l
0.28 0 l
0.28 0 l
0.28 0 l
1.13 0 l
0.28 0 l
1.41 0 l
0.85 0 l
1.12 0 l
1.70 0 l
0.56 0 l
1.13 0 l
0.28 0 l
0.28 0 l
0.85 0 l
1.40 0 l
0.29 -0.04 l
0.84 0 l
0.57 0 l
0.28 0 l
0.84 0 l
2.26 0 l
0.28 0 l
0.56 0 l
0.29 0 l
0.28 0 l
2.53 0 l
0.29 0 l
0.56 0 l
0.28 -0.02 l
0.28 0 l
0.28 0 l
1.41 0 l
1.41 0 l
2.54 0 l
0.56 0 l
0.29 0 l
0.56 0 l
0.84 0 l
0.29 0 l
0.56 0 l
0.56 0 l
0.29 -0.02 l
0.28 0 l
0.56 0 l
0.28 0 l
0.57 0 l
0.28 0 l
1.97 0 l
0.85 0 l
0.28 0 l
0.28 0 l
3.10 0 l
0.56 0 l
0.85 0 l
1.13 0 l
2.53 0 l
1.98 0 l
0.56 0 l
0.85 0 l
1.69 0 l
0.28 0 l
2.82 -0.56 l
0.56 0 l
1.41 0 l
1.13 0 l
0.28 0 l
0.28 0 l
0.85 0 l
1.12 0 l
2.82 -2.76 l
2.54 0 l
2.54 0 l
0.84 0 l
0.28 0 l
0.85 0 l
0.28 0 l
0.56 0 l
1.13 0 l
0.28 0 l
0.85 -1.38 l
1.13 0 l
2.25 0 l
3.10 0 l
0.85 0 l
166.97 357.09 lineto
0.85 0 l
1.13 -0.31 l
0.28 0 l
1.41 0 l
2.54 0 l
0.28 0 l
0.84 0 l
1.13 0 l
0.28 -0.04 l
1.69 0 l
0.28 0 l
0.29 0 l
0.28 -0.21 l
1.13 0 l
2.25 0 l
1.69 0 l
1.41 0 l
0.56 0 l
0.29 0 l
0.84 -0.09 l
1.13 0 l
0.28 -0.29 l
0.56 0 l
0.85 0 l
4.23 -1.90 l
1.41 0 l
1.97 -1.20 l
0.28 0 l
1.41 0 l
4.51 0 l
1.69 -0.31 l
0.28 -0.21 l
0.57 -0.63 l
3.10 0 l
1.69 0 l
1.13 0 l
0.56 0 l
1.41 0 l
2.25 0 l
2.26 -0.83 l
0.28 0 l
1.69 0 l
1.97 0 l
4.80 0 l
2.53 -7.20 l
0.57 -4.42 l
1.40 -9.52 l
1.98 0 l
0.56 0 l
1.41 -1.25 l
1.41 0 l
0.85 0 l
2.53 0 l
2.26 0 l
1.69 0 l
0.56 0 l
8.74 0 l
1.69 0 l
1.41 -2.91 l
0.28 -0.11 l
1.69 0 l
1.13 0 l
2.82 -0.16 l
2.25 0 l
3.67 -5.76 l
3.38 -4.93 l
2.25 -14.52 l
0.85 0 l
0.28 0 l
3.95 0 l
4.79 0 l
5.35 0 l
0.28 0 l
4.23 0 l
0.85 0 l
3.38 0 l
1.69 0 l
3.10 -0.67 l
3.95 -0.31 l
14.37 0 l
3.95 -0.32 l
0.84 0 l
29.88 -54.54 l
5.35 0 l
11.84 0 l
31.28 -11.06 l
5.08 -62.88 l
13.81 -0.21 l
23.39 -4.89 l
1.13 0 l
40.30 -28.12 l
88.29 0 l
o
np
76.78 361.87 m
0.85 0 l
0.56 0 l
0.29 0 l
0.28 0 l
0.28 0 l
0.85 0 l
0.28 0 l
0.84 0 l
2.26 0 l
0.28 0 l
1.13 -0.35 l
0.28 0 l
0.28 0 l
0.85 0 l
0.28 0 l
0.28 0 l
0.28 0 l
0.28 0 l
1.13 0 l
0.28 0 l
1.41 0 l
0.85 0 l
1.12 0 l
1.70 0 l
0.56 -0.13 l
1.13 0 l
0.28 0 l
0.28 0 l
0.85 0 l
1.40 0 l
0.29 0 l
0.84 0 l
0.57 0 l
0.28 0 l
0.84 0 l
2.26 0 l
0.28 0 l
0.56 0 l
0.29 0 l
0.28 0 l
2.53 0 l
0.29 0 l
0.56 -0.56 l
0.28 -0.02 l
0.28 0 l
0.28 0 l
1.41 0 l
1.41 0 l
2.54 0 l
0.56 0 l
0.29 0 l
0.56 0 l
0.84 0 l
0.29 0 l
0.56 -1.07 l
0.56 0 l
0.29 0 l
0.28 0 l
0.56 0 l
0.28 0 l
0.57 -0.24 l
0.28 0 l
1.97 0 l
0.85 -0.26 l
0.28 0 l
0.28 0 l
3.10 0 l
0.56 0 l
0.85 0 l
1.13 0 l
2.53 0 l
1.98 0 l
0.56 -0.06 l
0.85 0 l
1.69 0 l
0.28 0 l
2.82 0 l
0.56 0 l
1.41 0 l
1.13 0 l
0.28 0 l
0.28 0 l
0.85 0 l
1.12 -0.10 l
2.82 0 l
2.54 0 l
2.54 0 l
0.84 0 l
0.28 0 l
0.85 0 l
0.28 0 l
0.56 -1.76 l
1.13 0 l
0.28 0 l
0.85 0 l
1.13 0 l
2.25 0 l
3.10 0 l
0.85 -0.28 l
166.97 357.04 lineto
0.85 0 l
1.13 -0.31 l
0.28 0 l
1.41 0 l
2.54 0 l
0.28 0 l
0.84 -0.88 l
1.13 -0.10 l
0.28 0 l
1.69 0 l
0.28 0 l
0.29 0 l
0.28 -8.65 l
1.13 0 l
2.25 0 l
1.69 0 l
1.41 0 l
0.56 0 l
0.29 0 l
0.84 0 l
1.13 0 l
0.28 0 l
0.56 0 l
0.85 0 l
4.23 0 l
1.41 -0.76 l
1.97 0 l
0.28 0 l
1.41 0 l
4.51 0 l
1.69 0 l
0.28 0 l
0.57 0 l
3.10 -1.11 l
1.69 0 l
1.13 0 l
0.56 -0.08 l
1.41 -0.16 l
2.25 0 l
2.26 -4.24 l
0.28 0 l
1.69 -0.10 l
1.97 -12.83 l
4.80 -0.02 l
2.53 -6.78 l
0.57 0 l
1.40 -8.76 l
1.98 0 l
0.56 0 l
1.41 0 l
1.41 0 l
0.85 0 l
2.53 0 l
2.26 0 l
1.69 -0.07 l
0.56 0 l
8.74 0 l
1.69 0 l
1.41 0 l
0.28 0 l
1.69 0 l
1.13 -4.49 l
2.82 -0.16 l
2.25 -0.92 l
3.67 -1.30 l
3.38 -18.95 l
2.25 -2.79 l
0.85 0 l
0.28 0 l
3.95 0 l
4.79 -20.22 l
5.35 0 l
0.28 -4.62 l
4.23 0 l
0.85 0 l
3.38 0 l
1.69 -4.18 l
3.10 0 l
3.95 -0.31 l
14.37 0 l
3.95 -0.63 l
0.84 -1.82 l
29.88 -45.50 l
5.35 0 l
11.84 -4.34 l
31.28 -11.09 l
5.08 -51.37 l
13.81 0 l
23.39 -3.07 l
1.13 0 l
40.30 0 l
88.29 -1.42 l
o
np
76.78 361.87 m
0.85 0 l
0.56 0 l
0.29 0 l
0.28 0 l
0.28 0 l
0.85 0 l
0.28 0 l
0.84 0 l
2.26 0 l
0.28 0 l
1.13 0 l
0.28 0 l
0.28 0 l
0.85 0 l
0.28 0 l
0.28 0 l
0.28 0 l
0.28 0 l
1.13 0 l
0.28 0 l
1.41 0 l
0.85 0 l
1.12 0 l
1.70 0 l
0.56 0 l
1.13 0 l
0.28 0 l
0.28 0 l
0.85 0 l
1.40 0 l
0.29 -0.04 l
0.84 0 l
0.57 0 l
0.28 0 l
0.84 0 l
2.26 0 l
0.28 0 l
0.56 0 l
0.29 -9.51 l
0.28 0 l
2.53 0 l
0.29 0 l
0.56 0 l
0.28 -0.03 l
0.28 0 l
0.28 0 l
1.41 0 l
1.41 0 l
2.54 0 l
0.56 0 l
0.29 0 l
0.56 0 l
0.84 0 l
0.29 0 l
0.56 -32.21 l
0.56 0 l
0.29 0 l
0.28 0 l
0.56 0 l
0.28 0 l
0.57 0 l
0.28 0 l
1.97 0 l
0.85 0 l
0.28 0 l
0.28 0 l
3.10 0 l
0.56 0 l
0.85 0 l
1.13 0 l
2.53 0 l
1.98 0 l
0.56 0 l
0.85 0 l
1.69 0 l
0.28 0 l
2.82 0 l
0.56 0 l
1.41 0 l
1.13 0 l
0.28 0 l
0.28 0 l
0.85 0 l
1.12 0 l
2.82 0 l
2.54 0 l
2.54 0 l
0.84 0 l
0.28 0 l
0.85 0 l
0.28 0 l
0.56 0 l
1.13 0 l
0.28 0 l
0.85 0 l
1.13 0 l
2.25 0 l
3.10 0 l
0.85 0 l
166.97 320.08 lineto
0.85 0 l
1.13 -0.94 l
0.28 0 l
1.41 0 l
2.54 0 l
0.28 0 l
0.84 0 l
1.13 0 l
0.28 0 l
1.69 0 l
0.28 0 l
0.29 0 l
0.28 -7.00 l
1.13 0 l
2.25 0 l
1.69 0 l
1.41 0 l
0.56 0 l
0.29 0 l
0.84 0 l
1.13 0 l
0.28 0 l
0.56 0 l
0.85 0 l
4.23 0 l
1.41 0 l
1.97 0 l
0.28 0 l
1.41 0 l
4.51 0 l
1.69 -0.31 l
0.28 -0.21 l
0.57 0 l
3.10 0 l
1.69 0 l
1.13 0 l
0.56 0 l
1.41 0 l
2.25 0 l
2.26 -0.64 l
0.28 0 l
1.69 0 l
1.97 0 l
4.80 0 l
2.53 -7.83 l
0.57 0 l
1.40 -9.56 l
1.98 0 l
0.56 0 l
1.41 0 l
1.41 0 l
0.85 -0.31 l
2.53 0 l
2.26 0 l
1.69 0 l
0.56 0 l
8.74 0 l
1.69 -0.32 l
1.41 0 l
0.28 -0.10 l
1.69 0 l
1.13 0 l
2.82 -0.16 l
2.25 0 l
3.67 0 l
3.38 -5.96 l
2.25 0 l
0.85 0 l
0.28 0 l
3.95 0 l
4.79 0 l
5.35 0 l
0.28 0 l
4.23 0 l
0.85 0 l
3.38 0 l
1.69 0 l
3.10 0 l
3.95 0 l
14.37 0 l
3.95 -1.09 l
0.84 0 l
29.88 -62.76 l
5.35 0 l
11.84 0 l
31.28 -17.39 l
5.08 -78.01 l
13.81 0 l
23.39 -6.61 l
1.13 0 l
40.30 0 l
88.29 0 l
o
np
76.78 361.87 m
0.85 0 l
0.56 0 l
0.29 0 l
0.28 0 l
0.28 0 l
0.85 0 l
0.28 0 l
0.84 0 l
2.26 0 l
0.28 0 l
1.13 0 l
0.28 0 l
0.28 0 l
0.85 0 l
0.28 0 l
0.28 0 l
0.28 -0.07 l
0.28 0 l
1.13 0 l
0.28 0 l
1.41 0 l
0.85 0 l
1.12 0 l
1.70 0 l
0.56 0 l
1.13 0 l
0.28 0 l
0.28 0 l
0.85 0 l
1.40 -12.13 l
0.29 0 l
0.84 0 l
0.57 0 l
0.28 0 l
0.84 0 l
2.26 0 l
0.28 -43.47 l
0.56 -0.05 l
0.29 0 l
0.28 0 l
2.53 0 l
0.29 0 l
0.56 0 l
0.28 0 l
0.28 0 l
0.28 0 l
1.41 0 l
1.41 0 l
2.54 0 l
0.56 0 l
0.29 0 l
0.56 0 l
0.84 0 l
0.29 0 l
0.56 0 l
0.56 0 l
0.29 0 l
0.28 0 l
0.56 0 l
0.28 0 l
0.57 0 l
0.28 0 l
1.97 0 l
0.85 0 l
0.28 -0.06 l
0.28 0 l
3.10 0 l
0.56 0 l
0.85 0 l
1.13 0 l
2.53 0 l
1.98 0 l
0.56 0 l
0.85 -0.02 l
1.69 0 l
0.28 0 l
2.82 0 l
0.56 0 l
1.41 0 l
1.13 0 l
0.28 0 l
0.28 0 l
0.85 0 l
1.12 0 l
2.82 0 l
2.54 0 l
2.54 0 l
0.84 0 l
0.28 0 l
0.85 0 l
0.28 0 l
0.56 0 l
1.13 0 l
0.28 0 l
0.85 0 l
1.13 0 l
2.25 0 l
3.10 0 l
0.85 0 l
166.97 306.07 lineto
0.85 0 l
1.13 -7.65 l
0.28 0 l
1.41 0 l
2.54 0 l
0.28 0 l
0.84 0 l
1.13 0 l
0.28 0 l
1.69 0 l
0.28 0 l
0.29 0 l
0.28 0 l
1.13 0 l
2.25 0 l
1.69 0 l
1.41 0 l
0.56 0 l
0.29 0 l
0.84 -0.02 l
1.13 0 l
0.28 0 l
0.56 0 l
0.85 -0.54 l
4.23 -0.06 l
1.41 0 l
1.97 0 l
0.28 0 l
1.41 0 l
4.51 0 l
1.69 0 l
0.28 0 l
0.57 0 l
3.10 -0.23 l
1.69 0 l
1.13 0 l
0.56 -0.02 l
1.41 -0.47 l
2.25 0 l
2.26 0 l
0.28 -0.10 l
1.69 -0.11 l
1.97 -0.80 l
4.80 -3.36 l
2.53 0 l
0.57 -0.27 l
1.40 -0.07 l
1.98 0 l
0.56 0 l
1.41 -0.34 l
1.41 -0.35 l
0.85 0 l
2.53 0 l
2.26 0 l
1.69 -0.36 l
0.56 0 l
8.74 -0.08 l
1.69 -64.15 l
1.41 -0.63 l
0.28 0 l
1.69 0 l
1.13 -0.15 l
2.82 0 l
2.25 -7.06 l
3.67 -1.13 l
3.38 0 l
2.25 -49.00 l
0.85 -3.02 l
0.28 0 l
3.95 0 l
4.79 0 l
5.35 0 l
0.28 0 l
4.23 -4.90 l
0.85 0 l
3.38 0 l
1.69 -18.30 l
3.10 -0.08 l
3.95 0 l
14.37 0 l
3.95 0 l
0.84 -21.66 l
29.88 0 l
5.35 0 l
11.84 -15.17 l
31.28 0 l
5.08 0 l
13.81 0 l
23.39 -5.08 l
1.13 -3.38 l
40.30 0 l
88.29 -7.44 l
o
np
76.78 361.87 m
0.85 0 l
0.56 0 l
0.29 0 l
0.28 0 l
0.28 0 l
0.85 0 l
0.28 0 l
0.84 0 l
2.26 0 l
0.28 0 l
1.13 -0.04 l
0.28 0 l
0.28 0 l
0.85 0 l
0.28 0 l
0.28 0 l
0.28 0 l
0.28 0 l
1.13 0 l
0.28 0 l
1.41 0 l
0.85 -76.16 l
1.12 0 l
1.70 0 l
0.56 -0.13 l
1.13 0 l
0.28 0 l
0.28 0 l
0.85 0 l
1.40 0 l
0.29 -0.28 l
0.84 0 l
0.57 0 l
0.28 0 l
0.84 0 l
2.26 0 l
0.28 0 l
0.56 0 l
0.29 0 l
0.28 0 l
2.53 0 l
0.29 0 l
0.56 -0.25 l
0.28 0 l
0.28 0 l
0.28 0 l
1.41 0 l
1.41 0 l
2.54 0 l
0.56 0 l
0.29 0 l
0.56 0 l
0.84 0 l
0.29 0 l
0.56 -0.46 l
0.56 0 l
0.29 0 l
0.28 0 l
0.56 0 l
0.28 0 l
0.57 -0.51 l
0.28 0 l
1.97 0 l
0.85 -0.88 l
0.28 0 l
0.28 0 l
3.10 0 l
0.56 0 l
0.85 0 l
1.13 0 l
2.53 0 l
1.98 0 l
0.56 -0.06 l
0.85 0 l
1.69 0 l
0.28 0 l
2.82 0 l
0.56 0 l
1.41 0 l
1.13 0 l
0.28 0 l
0.28 0 l
0.85 0 l
1.12 0 l
2.82 0 l
2.54 0 l
2.54 0 l
0.84 0 l
0.28 0 l
0.85 -17.62 l
0.28 0 l
0.56 -2.43 l
1.13 0 l
0.28 0 l
0.85 0 l
1.13 0 l
2.25 -2.92 l
3.10 -0.04 l
0.85 0 l
166.97 260.05 lineto
0.85 0 l
1.13 0 l
0.28 0 l
1.41 0 l
2.54 0 l
0.28 0 l
0.84 -0.56 l
1.13 0 l
0.28 0 l
1.69 -7.85 l
0.28 0 l
0.29 0 l
0.28 -15.02 l
1.13 0 l
2.25 -4.53 l
1.69 0 l
1.41 0 l
0.56 -3.04 l
0.29 0 l
0.84 0 l
1.13 0 l
0.28 0 l
0.56 0 l
0.85 0 l
4.23 0 l
1.41 -0.35 l
1.97 0 l
0.28 0 l
1.41 0 l
4.51 0 l
1.69 0 l
0.28 0 l
0.57 0 l
3.10 0 l
1.69 0 l
1.13 0 l
0.56 0 l
1.41 -0.15 l
2.25 0 l
2.26 -1.01 l
0.28 0 l
1.69 0 l
1.97 -7.60 l
4.80 0 l
2.53 0 l
0.57 0 l
1.40 -0.97 l
1.98 0 l
0.56 0 l
1.41 0 l
1.41 -0.78 l
0.85 0 l
2.53 0 l
2.26 0 l
1.69 0 l
0.56 -0.64 l
8.74 0 l
1.69 -4.55 l
1.41 0 l
0.28 -28.43 l
1.69 0 l
1.13 0 l
2.82 -2.08 l
2.25 -0.63 l
3.67 -1.19 l
3.38 -4.63 l
2.25 0 l
0.85 0 l
0.28 -0.18 l
3.95 -0.21 l
4.79 -12.08 l
5.35 0 l
0.28 -2.36 l
4.23 -0.16 l
0.85 -3.12 l
3.38 0 l
1.69 0 l
3.10 0 l
3.95 -9.26 l
14.37 -12.23 l
3.95 -0.13 l
0.84 -2.60 l
29.88 -0.70 l
5.35 -1.87 l
11.84 0 l
31.28 -4.99 l
5.08 -1.44 l
13.81 -8.02 l
23.39 -22.23 l
1.13 -0.38 l
40.30 0 l
88.29 -1.07 l
o
np
76.78 361.87 m
0.85 0 l
0.56 0 l
0.29 0 l
0.28 0 l
0.28 0 l
0.85 0 l
0.28 0 l
0.84 0 l
2.26 -0.52 l
0.28 0 l
1.13 0 l
0.28 0 l
0.28 0 l
0.85 0 l
0.28 0 l
0.28 0 l
0.28 0 l
0.28 0 l
1.13 0 l
0.28 0 l
1.41 0 l
0.85 0 l
1.12 -0.16 l
1.70 0 l
0.56 0 l
1.13 0 l
0.28 -0.03 l
0.28 0 l
0.85 0 l
1.40 0 l
0.29 -0.04 l
0.84 0 l
0.57 0 l
0.28 -0.06 l
0.84 0 l
2.26 -0.04 l
0.28 0 l
0.56 0 l
0.29 0 l
0.28 0 l
2.53 0 l
0.29 0 l
0.56 -0.47 l
0.28 -0.02 l
0.28 0 l
0.28 0 l
1.41 0 l
1.41 0 l
2.54 0 l
0.56 0 l
0.29 0 l
0.56 0 l
0.84 -0.02 l
0.29 0 l
0.56 0 l
0.56 -3.56 l
0.29 0 l
0.28 0 l
0.56 0 l
0.28 0 l
0.57 0 l
0.28 0 l
1.97 0 l
0.85 0 l
0.28 0 l
0.28 0 l
3.10 0 l
0.56 0 l
0.85 0 l
1.13 0 l
2.53 0 l
1.98 0 l
0.56 0 l
0.85 0 l
1.69 -2.44 l
0.28 0 l
2.82 0 l
0.56 -0.06 l
1.41 0 l
1.13 0 l
0.28 0 l
0.28 0 l
0.85 0 l
1.12 0 l
2.82 0 l
2.54 0 l
2.54 0 l
0.84 0 l
0.28 0 l
0.85 0 l
0.28 0 l
0.56 0 l
1.13 0 l
0.28 0 l
0.85 0 l
1.13 0 l
2.25 0 l
3.10 0 l
0.85 -3.79 l
166.97 350.66 lineto
0.85 0 l
1.13 -0.31 l
0.28 0 l
1.41 0 l
2.54 0 l
0.28 -1.82 l
0.84 -3.49 l
1.13 0 l
0.28 0 l
1.69 -1.99 l
0.28 -5.36 l
0.29 -6.27 l
0.28 0 l
1.13 0 l
2.25 0 l
1.69 0 l
1.41 0 l
0.56 0 l
0.29 0 l
0.84 0 l
1.13 0 l
0.28 -4.39 l
0.56 -7.94 l
0.85 0 l
4.23 -13.59 l
1.41 0 l
1.97 0 l
0.28 0 l
1.41 0 l
4.51 0 l
1.69 -0.31 l
0.28 -0.21 l
0.57 0 l
3.10 0 l
1.69 0 l
1.13 0 l
0.56 0 l
1.41 0 l
2.25 0 l
2.26 -0.91 l
0.28 0 l
1.69 0 l
1.97 0 l
4.80 0 l
2.53 -7.17 l
0.57 0 l
1.40 -9.21 l
1.98 -10.27 l
0.56 0 l
1.41 0 l
1.41 0 l
0.85 -0.31 l
2.53 0 l
2.26 0 l
1.69 0 l
0.56 0 l
8.74 0 l
1.69 -0.31 l
1.41 0 l
0.28 0 l
1.69 0 l
1.13 0 l
2.82 -0.16 l
2.25 0 l
3.67 0 l
3.38 -5.58 l
2.25 0 l
0.85 0 l
0.28 0 l
3.95 0 l
4.79 0 l
5.35 0 l
0.28 -6.17 l
4.23 0 l
0.85 0 l
3.38 0 l
1.69 0 l
3.10 0 l
3.95 0 l
14.37 0 l
3.95 -1.09 l
0.84 0 l
29.88 -55.14 l
5.35 0 l
11.84 0 l
31.28 -11.87 l
5.08 -64.06 l
13.81 0 l
23.39 -3.91 l
1.13 0 l
40.30 0 l
88.29 0 l
o
0.8039 0 0 srgb
1.50 setlinewidth
[ 4.50 7.50] 0 setdash
np
76.78 361.87 m
0.85 0 l
0.56 0 l
0.29 0 l
0.28 -32.18 l
0.28 0 l
0.85 0 l
0.28 0 l
0.84 0 l
2.26 0 l
0.28 -1.01 l
1.13 0 l
0.28 0 l
0.28 -12.81 l
0.85 0 l
0.28 0 l
0.28 0 l
0.28 -0.75 l
0.28 0 l
1.13 0 l
0.28 0 l
1.41 0 l
0.85 0 l
1.12 0 l
1.70 0 l
0.56 0 l
1.13 0 l
0.28 0 l
0.28 0 l
0.85 0 l
1.40 0 l
0.29 0 l
0.84 0 l
0.57 0 l
0.28 0 l
0.84 0 l
2.26 -67.24 l
0.28 0 l
0.56 0 l
0.29 0 l
0.28 0 l
2.53 -0.13 l
0.29 0 l
0.56 0 l
0.28 0 l
0.28 0 l
0.28 0 l
1.41 0 l
1.41 0 l
2.54 0 l
0.56 0 l
0.29 0 l
0.56 -0.74 l
0.84 -0.41 l
0.29 -0.32 l
0.56 0 l
0.56 0 l
0.29 0 l
0.28 0 l
0.56 0 l
0.28 -0.14 l
0.57 -0.06 l
0.28 0 l
1.97 0 l
0.85 0 l
0.28 0 l
0.28 0 l
3.10 0 l
0.56 0 l
0.85 0 l
1.13 0 l
2.53 0 l
1.98 0 l
0.56 0 l
0.85 0 l
1.69 0 l
0.28 0 l
2.82 0 l
0.56 0 l
1.41 -0.06 l
1.13 -0.08 l
0.28 -0.27 l
0.28 0 l
0.85 0 l
1.12 0 l
2.82 0 l
2.54 -0.15 l
2.54 0 l
0.84 0 l
0.28 0 l
0.85 0 l
0.28 0 l
0.56 0 l
1.13 0 l
0.28 0 l
0.85 0 l
1.13 0 l
2.25 0 l
3.10 -0.81 l
0.85 0 l
166.97 244.71 lineto
0.85 0 l
1.13 -6.31 l
0.28 0 l
1.41 0 l
2.54 -1.10 l
0.28 0 l
0.84 0 l
1.13 0 l
0.28 0 l
1.69 0 l
0.28 0 l
0.29 0 l
0.28 0 l
1.13 -0.31 l
2.25 0 l
1.69 -3.37 l
1.41 0 l
0.56 0 l
0.29 -1.58 l
0.84 0 l
1.13 -0.04 l
0.28 0 l
0.56 0 l
0.85 0 l
4.23 0 l
1.41 0 l
1.97 0 l
0.28 0 l
1.41 0 l
4.51 0 l
1.69 0 l
0.28 0 l
0.57 0 l
3.10 0 l
1.69 -2.10 l
1.13 0 l
0.56 0 l
1.41 -64.97 l
2.25 0 l
2.26 0 l
0.28 0 l
1.69 0 l
1.97 -0.34 l
4.80 0 l
2.53 0 l
0.57 0 l
1.40 0 l
1.98 0 l
0.56 -6.25 l
1.41 0 l
1.41 -0.03 l
0.85 0 l
2.53 0 l
2.26 0 l
1.69 -3.81 l
0.56 0 l
8.74 0 l
1.69 -0.31 l
1.41 0 l
0.28 0 l
1.69 0 l
1.13 0 l
2.82 -0.21 l
2.25 -4.79 l
3.67 0 l
3.38 0 l
2.25 0 l
0.85 0 l
0.28 -4.42 l
3.95 -2.08 l
4.79 0 l
5.35 0 l
0.28 0 l
4.23 -6.74 l
0.85 -3.89 l
3.38 0 l
1.69 0 l
3.10 0 l
3.95 0 l
14.37 0 l
3.95 -1.72 l
0.84 -1.56 l
29.88 0 l
5.35 -10.53 l
11.84 -0.31 l
31.28 0 l
5.08 0 l
13.81 -10.66 l
23.39 0 l
1.13 0 l
40.30 0 l
88.29 -10.81 l
o
np
76.78 361.87 m
0.85 0 l
0.56 0 l
0.29 0 l
0.28 0 l
0.28 0 l
0.85 0 l
0.28 -8.15 l
0.84 -22.76 l
2.26 0 l
0.28 0 l
1.13 -33.97 l
0.28 0 l
0.28 0 l
0.85 0 l
0.28 -0.30 l
0.28 0 l
0.28 0 l
0.28 0 l
1.13 0 l
0.28 0 l
1.41 -5.63 l
0.85 -1.38 l
1.12 0 l
1.70 -2.69 l
0.56 0 l
1.13 0 l
0.28 0 l
0.28 0 l
0.85 -9.99 l
1.40 0 l
0.29 0 l
0.84 0 l
0.57 0 l
0.28 0 l
0.84 0 l
2.26 0 l
0.28 0 l
0.56 -1.98 l
0.29 0 l
0.28 0 l
2.53 0 l
0.29 0 l
0.56 0 l
0.28 0 l
0.28 0 l
0.28 0 l
1.41 -15.74 l
1.41 0 l
2.54 0 l
0.56 0 l
0.29 0 l
0.56 0 l
0.84 -0.08 l
0.29 0 l
0.56 0 l
0.56 -2.75 l
0.29 0 l
0.28 0 l
0.56 0 l
0.28 0 l
0.57 0 l
0.28 -0.15 l
1.97 0 l
0.85 0 l
0.28 0 l
0.28 -12.67 l
3.10 -6.97 l
0.56 0 l
0.85 -1.16 l
1.13 0 l
2.53 0 l
1.98 0 l
0.56 0 l
0.85 0 l
1.69 0 l
0.28 0 l
2.82 -0.08 l
0.56 0 l
1.41 0 l
1.13 0 l
0.28 0 l
0.28 0 l
0.85 -0.47 l
1.12 0 l
2.82 0 l
2.54 -0.39 l
2.54 0 l
0.84 0 l
0.28 0 l
0.85 0 l
0.28 0 l
0.56 0 l
1.13 0 l
0.28 0 l
0.85 0 l
1.13 0 l
2.25 -13.25 l
3.10 0 l
0.85 0 l
166.97 221.31 lineto
0.85 -2.53 l
1.13 -11.87 l
0.28 -2.17 l
1.41 0 l
2.54 0 l
0.28 0 l
0.84 0 l
1.13 0 l
0.28 0 l
1.69 0 l
0.28 0 l
0.29 0 l
0.28 0 l
1.13 0 l
2.25 0 l
1.69 0 l
1.41 -27.32 l
0.56 -4.26 l
0.29 0 l
0.84 0 l
1.13 0 l
0.28 0 l
0.56 0 l
0.85 0 l
4.23 0 l
1.41 -1.16 l
1.97 0 l
0.28 -3.70 l
1.41 0 l
4.51 0 l
1.69 0 l
0.28 0 l
0.57 0 l
3.10 -6.62 l
1.69 0 l
1.13 0 l
0.56 0 l
1.41 0 l
2.25 0 l
2.26 -1.25 l
0.28 0 l
1.69 0 l
1.97 -0.21 l
4.80 0 l
2.53 0 l
0.57 0 l
1.40 0 l
1.98 0 l
0.56 0 l
1.41 0 l
1.41 -0.06 l
0.85 0 l
2.53 0 l
2.26 0 l
1.69 0 l
0.56 0 l
8.74 0 l
1.69 -0.31 l
1.41 0 l
0.28 0 l
1.69 0 l
1.13 0 l
2.82 -0.21 l
2.25 -4.06 l
3.67 0 l
3.38 -1.35 l
2.25 0 l
0.85 0 l
0.28 -6.27 l
3.95 -2.21 l
4.79 0 l
5.35 -0.31 l
0.28 0 l
4.23 -4.67 l
0.85 0 l
3.38 -19.26 l
1.69 -0.31 l
3.10 0 l
3.95 0 l
14.37 -0.63 l
3.95 0 l
0.84 -10.17 l
29.88 0 l
5.35 -13.77 l
11.84 0 l
31.28 -0.31 l
5.08 0 l
13.81 -1.25 l
23.39 0 l
1.13 0 l
40.30 -0.31 l
88.29 -0.42 l
o
np
76.78 361.87 m
0.85 0 l
0.56 0 l
0.29 0 l
0.28 0 l
0.28 0 l
0.85 0 l
0.28 0 l
0.84 0 l
2.26 0 l
0.28 0 l
1.13 0 l
0.28 0 l
0.28 -25.71 l
0.85 -0.16 l
0.28 0 l
0.28 0 l
0.28 0 l
0.28 0 l
1.13 0 l
0.28 0 l
1.41 0 l
0.85 0 l
1.12 0 l
1.70 0 l
0.56 0 l
1.13 0 l
0.28 0 l
0.28 0 l
0.85 0 l
1.40 0 l
0.29 0 l
0.84 -0.05 l
0.57 0 l
0.28 0 l
0.84 0 l
2.26 0 l
0.28 0 l
0.56 0 l
0.29 0 l
0.28 0 l
2.53 0 l
0.29 -0.10 l
0.56 0 l
0.28 -2.80 l
0.28 0 l
0.28 0 l
1.41 0 l
1.41 0 l
2.54 0 l
0.56 -0.03 l
0.29 0 l
0.56 0 l
0.84 -0.42 l
0.29 -0.28 l
0.56 0 l
0.56 0 l
0.29 0 l
0.28 0 l
0.56 0 l
0.28 0 l
0.57 0 l
0.28 0 l
1.97 0 l
0.85 0 l
0.28 0 l
0.28 -0.63 l
3.10 0 l
0.56 0 l
0.85 0 l
1.13 0 l
2.53 0 l
1.98 0 l
0.56 0 l
0.85 0 l
1.69 0 l
0.28 0 l
2.82 0 l
0.56 0 l
1.41 0 l
1.13 0 l
0.28 0 l
0.28 0 l
0.85 0 l
1.12 0 l
2.82 0 l
2.54 -0.47 l
2.54 0 l
0.84 0 l
0.28 -0.31 l
0.85 0 l
0.28 0 l
0.56 0 l
1.13 0 l
0.28 0 l
0.85 0 l
1.13 0 l
2.25 0 l
3.10 0 l
0.85 0 l
166.97 330.91 lineto
0.85 0 l
1.13 -18.58 l
0.28 0 l
1.41 0 l
2.54 -0.32 l
0.28 0 l
0.84 0 l
1.13 0 l
0.28 0 l
1.69 0 l
0.28 0 l
0.29 -1.94 l
0.28 0 l
1.13 0 l
2.25 0 l
1.69 0 l
1.41 0 l
0.56 0 l
0.29 0 l
0.84 0 l
1.13 0 l
0.28 0 l
0.56 0 l
0.85 0 l
4.23 -0.17 l
1.41 0 l
1.97 0 l
0.28 0 l
1.41 0 l
4.51 -4.12 l
1.69 0 l
0.28 0 l
0.57 0 l
3.10 -0.24 l
1.69 0 l
1.13 0 l
0.56 0 l
1.41 -0.31 l
2.25 -19.18 l
2.26 0 l
0.28 0 l
1.69 -0.15 l
1.97 -23.51 l
4.80 -0.66 l
2.53 0 l
0.57 0 l
1.40 0 l
1.98 0 l
0.56 0 l
1.41 0 l
1.41 -11.53 l
0.85 0 l
2.53 0 l
2.26 -17.78 l
1.69 -1.17 l
0.56 -6.98 l
8.74 -0.55 l
1.69 -0.62 l
1.41 0 l
0.28 0 l
1.69 -0.47 l
1.13 -0.11 l
2.82 -8.91 l
2.25 -9.49 l
3.67 -0.06 l
3.38 -9.29 l
2.25 -8.85 l
0.85 -10.88 l
0.28 0 l
3.95 0 l
4.79 0 l
5.35 0 l
0.28 0 l
4.23 0 l
0.85 0 l
3.38 -0.46 l
1.69 -18.27 l
3.10 0 l
3.95 0 l
14.37 0 l
3.95 0 l
0.84 -5.75 l
29.88 0 l
5.35 -0.31 l
11.84 -63.13 l
31.28 -13.35 l
5.08 0 l
13.81 0 l
23.39 0 l
1.13 0 l
40.30 -1.10 l
88.29 -1.10 l
o
np
76.78 361.87 m
0.85 0 l
0.56 0 l
0.29 0 l
0.28 0 l
0.28 0 l
0.85 0 l
0.28 0 l
0.84 0 l
2.26 0 l
0.28 0 l
1.13 0 l
0.28 0 l
0.28 0 l
0.85 -19.90 l
0.28 -1.77 l
0.28 -51.61 l
0.28 0 l
0.28 0 l
1.13 0 l
0.28 0 l
1.41 0 l
0.85 0 l
1.12 0 l
1.70 0 l
0.56 0 l
1.13 0 l
0.28 0 l
0.28 0 l
0.85 0 l
1.40 0 l
0.29 0 l
0.84 0 l
0.57 -9.28 l
0.28 0 l
0.84 0 l
2.26 -0.30 l
0.28 0 l
0.56 0 l
0.29 0 l
0.28 0 l
2.53 0 l
0.29 -27.61 l
0.56 0 l
0.28 -2.17 l
0.28 0 l
0.28 0 l
1.41 0 l
1.41 0 l
2.54 0 l
0.56 0 l
0.29 0 l
0.56 -0.24 l
0.84 -3.22 l
0.29 -61.06 l
0.56 -18.84 l
0.56 0 l
0.29 -0.02 l
0.28 0 l
0.56 0 l
0.28 0 l
0.57 0 l
0.28 0 l
1.97 0 l
0.85 0 l
0.28 0 l
0.28 0 l
3.10 -9.46 l
0.56 0 l
0.85 -1.90 l
1.13 0 l
2.53 0 l
1.98 0 l
0.56 -0.15 l
0.85 0 l
1.69 0 l
0.28 0 l
2.82 -0.06 l
0.56 0 l
1.41 0 l
1.13 0 l
0.28 0 l
0.28 0 l
0.85 -0.19 l
1.12 0 l
2.82 -0.93 l
2.54 0 l
2.54 -13.29 l
0.84 -0.13 l
0.28 0 l
0.85 0 l
0.28 0 l
0.56 0 l
1.13 -0.14 l
0.28 -0.31 l
0.85 -0.07 l
1.13 0 l
2.25 -4.82 l
3.10 0 l
0.85 0 l
166.97 134.40 lineto
0.85 -0.28 l
1.13 -1.57 l
0.28 0 l
1.41 0 l
2.54 0 l
0.28 0 l
0.84 0 l
1.13 0 l
0.28 -0.04 l
1.69 0 l
0.28 0 l
0.29 0 l
0.28 0 l
1.13 0 l
2.25 0 l
1.69 -0.99 l
1.41 -0.13 l
0.56 0 l
0.29 0 l
0.84 -0.65 l
1.13 0 l
0.28 -0.28 l
0.56 -0.60 l
0.85 0 l
4.23 -2.53 l
1.41 0 l
1.97 -1.23 l
0.28 -0.56 l
1.41 -0.43 l
4.51 0 l
1.69 0 l
0.28 0 l
0.57 -0.78 l
3.10 0 l
1.69 0 l
1.13 0 l
0.56 0 l
1.41 -21.54 l
2.25 0 l
2.26 0 l
0.28 -0.78 l
1.69 0 l
1.97 0 l
4.80 -0.23 l
2.53 0 l
0.57 -0.84 l
1.40 0 l
1.98 0 l
0.56 0 l
1.41 -0.15 l
1.41 0 l
0.85 0 l
2.53 -0.88 l
2.26 0 l
1.69 -1.75 l
0.56 -0.94 l
8.74 0 l
1.69 0 l
1.41 -0.88 l
0.28 -1.95 l
1.69 -3.37 l
1.13 0 l
2.82 0 l
2.25 -1.06 l
3.67 -0.26 l
3.38 0 l
2.25 -8.79 l
0.85 0 l
0.28 0 l
3.95 0 l
4.79 0 l
5.35 0 l
0.28 -1.30 l
4.23 0 l
0.85 -0.90 l
3.38 0 l
1.69 -1.33 l
3.10 -2.31 l
3.95 0 l
14.37 -0.78 l
3.95 0 l
0.84 -0.97 l
29.88 -2.35 l
5.35 0 l
11.84 -2.19 l
31.28 0 l
5.08 0 l
13.81 0 l
23.39 0 l
1.13 0 l
40.30 -6.25 l
88.29 -0.33 l
o
np
76.78 361.87 m
0.85 0 l
0.56 -48.26 l
0.29 0 l
0.28 0 l
0.28 0 l
0.85 0 l
0.28 0 l
0.84 0 l
2.26 0 l
0.28 0 l
1.13 0 l
0.28 0 l
0.28 -5.06 l
0.85 0 l
0.28 0 l
0.28 0 l
0.28 0 l
0.28 0 l
1.13 0 l
0.28 0 l
1.41 0 l
0.85 0 l
1.12 0 l
1.70 -0.50 l
0.56 -7.36 l
1.13 0 l
0.28 0 l
0.28 0 l
0.85 0 l
1.40 0 l
0.29 0 l
0.84 0 l
0.57 -43.47 l
0.28 -0.08 l
0.84 0 l
2.26 0 l
0.28 0 l
0.56 0 l
0.29 -16.54 l
0.28 -0.20 l
2.53 0 l
0.29 0 l
0.56 0 l
0.28 0 l
0.28 -0.03 l
0.28 0 l
1.41 0 l
1.41 0 l
2.54 0 l
0.56 0 l
0.29 0 l
0.56 -0.24 l
0.84 0 l
0.29 -0.08 l
0.56 0 l
0.56 0 l
0.29 0 l
0.28 0 l
0.56 0 l
0.28 0 l
0.57 0 l
0.28 0 l
1.97 -23.27 l
0.85 -34.99 l
0.28 0 l
0.28 0 l
3.10 0 l
0.56 0 l
0.85 0 l
1.13 0 l
2.53 0 l
1.98 0 l
0.56 0 l
0.85 0 l
1.69 0 l
0.28 0 l
2.82 -4.36 l
0.56 0 l
1.41 0 l
1.13 0 l
0.28 0 l
0.28 0 l
0.85 0 l
1.12 -0.55 l
2.82 0 l
2.54 0 l
2.54 -0.28 l
0.84 0 l
0.28 0 l
0.85 -1.66 l
0.28 0 l
0.56 0 l
1.13 0 l
0.28 0 l
0.85 0 l
1.13 -4.10 l
2.25 -0.15 l
3.10 0 l
0.85 0 l
166.97 170.69 lineto
0.85 0 l
1.13 -9.08 l
0.28 0 l
1.41 0 l
2.54 0 l
0.28 -0.79 l
0.84 0 l
1.13 0 l
0.28 -14.42 l
1.69 0 l
0.28 0 l
0.29 0 l
0.28 0 l
1.13 0 l
2.25 -0.02 l
1.69 0 l
1.41 -1.60 l
0.56 0 l
0.29 -3.54 l
0.84 0 l
1.13 0 l
0.28 0 l
0.56 0 l
0.85 -1.68 l
4.23 -0.17 l
1.41 0 l
1.97 0 l
0.28 -1.30 l
1.41 0 l
4.51 0 l
1.69 0 l
0.28 0 l
0.57 0 l
3.10 0 l
1.69 0 l
1.13 0 l
0.56 -4.86 l
1.41 -0.31 l
2.25 0 l
2.26 -4.90 l
0.28 0 l
1.69 0 l
1.97 -0.39 l
4.80 0 l
2.53 0 l
0.57 0 l
1.40 0 l
1.98 0 l
0.56 0 l
1.41 0 l
1.41 0 l
0.85 0 l
2.53 0 l
2.26 0 l
1.69 -0.32 l
0.56 0 l
8.74 -0.52 l
1.69 -0.31 l
1.41 0 l
0.28 0 l
1.69 0 l
1.13 0 l
2.82 0 l
2.25 -2.38 l
3.67 0 l
3.38 0 l
2.25 -3.05 l
0.85 0 l
0.28 0 l
3.95 -3.11 l
4.79 0 l
5.35 0 l
0.28 0 l
4.23 -1.84 l
0.85 0 l
3.38 -0.62 l
1.69 -6.92 l
3.10 -0.16 l
3.95 -0.78 l
14.37 0 l
3.95 0 l
0.84 -0.96 l
29.88 0 l
5.35 -7.63 l
11.84 -7.49 l
31.28 0 l
5.08 0 l
13.81 0 l
23.39 0 l
1.13 0 l
40.30 -0.31 l
88.29 -0.42 l
o
np
76.78 361.87 m
0.85 0 l
0.56 0 l
0.29 0 l
0.28 -22.49 l
0.28 0 l
0.85 0 l
0.28 0 l
0.84 0 l
2.26 0 l
0.28 0 l
1.13 0 l
0.28 0 l
0.28 0 l
0.85 0 l
0.28 0 l
0.28 0 l
0.28 0 l
0.28 0 l
1.13 0 l
0.28 0 l
1.41 0 l
0.85 0 l
1.12 0 l
1.70 0 l
0.56 -23.22 l
1.13 0 l
0.28 0 l
0.28 0 l
0.85 0 l
1.40 0 l
0.29 0 l
0.84 0 l
0.57 0 l
0.28 -0.14 l
0.84 0 l
2.26 -0.06 l
0.28 0 l
0.56 0 l
0.29 0 l
0.28 -0.20 l
2.53 0 l
0.29 0 l
0.56 0 l
0.28 0 l
0.28 -0.02 l
0.28 0 l
1.41 0 l
1.41 0 l
2.54 0 l
0.56 0 l
0.29 0 l
0.56 -0.24 l
0.84 0 l
0.29 -0.19 l
0.56 0 l
0.56 0 l
0.29 0 l
0.28 0 l
0.56 0 l
0.28 0 l
0.57 0 l
0.28 0 l
1.97 0 l
0.85 -1.84 l
0.28 -0.54 l
0.28 0 l
3.10 0 l
0.56 0 l
0.85 0 l
1.13 -31.81 l
2.53 0 l
1.98 0 l
0.56 -0.16 l
0.85 0 l
1.69 0 l
0.28 0 l
2.82 -31.02 l
0.56 0 l
1.41 0 l
1.13 0 l
0.28 0 l
0.28 0 l
0.85 -1.50 l
1.12 0 l
2.82 0 l
2.54 0 l
2.54 0 l
0.84 0 l
0.28 -9.84 l
0.85 -1.87 l
0.28 0 l
0.56 0 l
1.13 0 l
0.28 -0.21 l
0.85 -0.35 l
1.13 -1.19 l
2.25 -5.60 l
3.10 0 l
0.85 0 l
166.97 229.38 lineto
0.85 0 l
1.13 -7.57 l
0.28 0 l
1.41 0 l
2.54 0 l
0.28 0 l
0.84 0 l
1.13 0 l
0.28 -1.34 l
1.69 0 l
0.28 0 l
0.29 -0.35 l
0.28 0 l
1.13 0 l
2.25 0 l
1.69 -0.24 l
1.41 -2.72 l
0.56 -0.34 l
0.29 0 l
0.84 -0.87 l
1.13 -7.94 l
0.28 -0.66 l
0.56 -2.85 l
0.85 -6.95 l
4.23 0 l
1.41 0 l
1.97 0 l
0.28 -4.18 l
1.41 0 l
4.51 0 l
1.69 0 l
0.28 0 l
0.57 0 l
3.10 0 l
1.69 0 l
1.13 0 l
0.56 -6.66 l
1.41 -39.50 l
2.25 0 l
2.26 -0.65 l
0.28 -1.09 l
1.69 0 l
1.97 0 l
4.80 0 l
2.53 0 l
0.57 0 l
1.40 0 l
1.98 0 l
0.56 0 l
1.41 -5.44 l
1.41 0 l
0.85 0 l
2.53 0 l
2.26 0 l
1.69 -9.88 l
0.56 -5.33 l
8.74 -0.70 l
1.69 0 l
1.41 0 l
0.28 -3.83 l
1.69 0 l
1.13 0 l
2.82 -1.20 l
2.25 0 l
3.67 0 l
3.38 0 l
2.25 0 l
0.85 0 l
0.28 0 l
3.95 0 l
4.79 -14.43 l
5.35 0 l
0.28 0 l
4.23 -4.97 l
0.85 -2.06 l
3.38 -0.16 l
1.69 0 l
3.10 -0.10 l
3.95 0 l
14.37 -1.00 l
3.95 0 l
0.84 0 l
29.88 0 l
5.35 0 l
11.84 0 l
31.28 0 l
5.08 -7.43 l
13.81 0 l
23.39 0 l
1.13 0 l
40.30 0 l
88.29 0 l
o
np
76.78 361.87 m
0.85 0 l
0.56 0 l
0.29 0 l
0.28 0 l
0.28 -0.38 l
0.85 0 l
0.28 -0.28 l
0.84 0 l
2.26 0 l
0.28 0 l
1.13 0 l
0.28 0 l
0.28 -2.38 l
0.85 -6.80 l
0.28 -1.65 l
0.28 0 l
0.28 0 l
0.28 0 l
1.13 0 l
0.28 0 l
1.41 0 l
0.85 0 l
1.12 0 l
1.70 0 l
0.56 -2.39 l
1.13 0 l
0.28 0 l
0.28 0 l
0.85 0 l
1.40 0 l
0.29 0 l
0.84 0 l
0.57 0 l
0.28 -3.65 l
0.84 0 l
2.26 0 l
0.28 0 l
0.56 0 l
0.29 0 l
0.28 0 l
2.53 0 l
0.29 0 l
0.56 -2.21 l
0.28 -2.50 l
0.28 -0.48 l
0.28 0 l
1.41 0 l
1.41 0 l
2.54 0 l
0.56 0 l
0.29 0 l
0.56 0 l
0.84 0 l
0.29 0 l
0.56 0 l
0.56 0 l
0.29 -0.39 l
0.28 0 l
0.56 0 l
0.28 0 l
0.57 0 l
0.28 0 l
1.97 0 l
0.85 0 l
0.28 -121.46 l
0.28 0 l
3.10 0 l
0.56 -18.96 l
0.85 0 l
1.13 -5.97 l
2.53 0 l
1.98 -27.73 l
0.56 0 l
0.85 -1.60 l
1.69 0 l
0.28 0 l
2.82 -1.30 l
0.56 0 l
1.41 0 l
1.13 0 l
0.28 0 l
0.28 0 l
0.85 -0.68 l
1.12 0 l
2.82 0 l
2.54 -0.32 l
2.54 0 l
0.84 0 l
0.28 0 l
0.85 0 l
0.28 0 l
0.56 0 l
1.13 0 l
0.28 0 l
0.85 -0.74 l
1.13 0 l
2.25 0 l
3.10 0 l
0.85 0 l
166.97 160.00 lineto
0.85 0 l
1.13 -2.71 l
0.28 -22.87 l
1.41 -3.71 l
2.54 0 l
0.28 0 l
0.84 0 l
1.13 0 l
0.28 -1.57 l
1.69 0 l
0.28 -2.58 l
0.29 -0.35 l
0.28 0 l
1.13 0 l
2.25 0 l
1.69 0 l
1.41 0 l
0.56 -4.87 l
0.29 0 l
0.84 0 l
1.13 -0.08 l
0.28 0 l
0.56 0 l
0.85 0 l
4.23 -19.60 l
1.41 0 l
1.97 0 l
0.28 0 l
1.41 0 l
4.51 0 l
1.69 0 l
0.28 -2.35 l
0.57 0 l
3.10 0 l
1.69 0 l
1.13 0 l
0.56 0 l
1.41 0 l
2.25 -6.00 l
2.26 0 l
0.28 0 l
1.69 0 l
1.97 -0.10 l
4.80 0 l
2.53 0 l
0.57 0 l
1.40 0 l
1.98 0 l
0.56 -0.21 l
1.41 0 l
1.41 0 l
0.85 0 l
2.53 0 l
2.26 0 l
1.69 -1.08 l
0.56 0 l
8.74 -1.62 l
1.69 0 l
1.41 0 l
0.28 0 l
1.69 0 l
1.13 0 l
2.82 -2.67 l
2.25 -0.52 l
3.67 -2.50 l
3.38 0 l
2.25 0 l
0.85 0 l
0.28 -5.74 l
3.95 0 l
4.79 0 l
5.35 -0.16 l
0.28 0 l
4.23 0 l
0.85 0 l
3.38 0 l
1.69 0 l
3.10 -0.50 l
3.95 0 l
14.37 -0.47 l
3.95 0 l
0.84 -0.31 l
29.88 0 l
5.35 -2.18 l
11.84 -1.96 l
31.28 0 l
5.08 -2.39 l
13.81 0 l
23.39 0 l
1.13 -1.40 l
40.30 0 l
88.29 0 l
o
np
76.78 361.87 m
0.85 0 l
0.56 0 l
0.29 0 l
0.28 0 l
0.28 0 l
0.85 0 l
0.28 0 l
0.84 0 l
2.26 0 l
0.28 0 l
1.13 -0.04 l
0.28 0 l
0.28 0 l
0.85 0 l
0.28 0 l
0.28 0 l
0.28 0 l
0.28 0 l
1.13 0 l
0.28 0 l
1.41 -0.13 l
0.85 -0.86 l
1.12 0 l
1.70 0 l
0.56 -0.12 l
1.13 0 l
0.28 -4.92 l
0.28 0 l
0.85 0 l
1.40 0 l
0.29 0 l
0.84 0 l
0.57 0 l
0.28 0 l
0.84 -1.07 l
2.26 0 l
0.28 0 l
0.56 -1.78 l
0.29 0 l
0.28 -1.53 l
2.53 0 l
0.29 -0.67 l
0.56 0 l
0.28 0 l
0.28 -1.53 l
0.28 -1.57 l
1.41 0 l
1.41 0 l
2.54 0 l
0.56 0 l
0.29 0 l
0.56 0 l
0.84 -0.14 l
0.29 0 l
0.56 -0.12 l
0.56 -1.19 l
0.29 0 l
0.28 0 l
0.56 0 l
0.28 0 l
0.57 -4.85 l
0.28 0 l
1.97 0 l
0.85 -0.24 l
0.28 0 l
0.28 0 l
3.10 0 l
0.56 0 l
0.85 0 l
1.13 0 l
2.53 0 l
1.98 0 l
0.56 -0.16 l
0.85 0 l
1.69 -10.78 l
0.28 0 l
2.82 -10.76 l
0.56 0 l
1.41 0 l
1.13 0 l
0.28 0 l
0.28 0 l
0.85 -0.46 l
1.12 -0.17 l
2.82 0 l
2.54 -1.75 l
2.54 -0.06 l
0.84 -0.75 l
0.28 -0.47 l
0.85 0 l
0.28 -13.35 l
0.56 -0.31 l
1.13 0 l
0.28 -1.50 l
0.85 0 l
1.13 0 l
2.25 0 l
3.10 -1.39 l
0.85 0 l
166.97 299.20 lineto
0.85 0 l
1.13 -6.15 l
0.28 0 l
1.41 0 l
2.54 0 l
0.28 0 l
0.84 -0.25 l
1.13 0 l
0.28 -1.47 l
1.69 0 l
0.28 0 l
0.29 -0.95 l
0.28 -1.54 l
1.13 0 l
2.25 0 l
1.69 0 l
1.41 0 l
0.56 0 l
0.29 0 l
0.84 -1.32 l
1.13 -8.80 l
0.28 -0.28 l
0.56 0 l
0.85 -9.61 l
4.23 0 l
1.41 -3.28 l
1.97 0 l
0.28 -2.58 l
1.41 0 l
4.51 0 l
1.69 0 l
0.28 0 l
0.57 0 l
3.10 0 l
1.69 0 l
1.13 0 l
0.56 -30.12 l
1.41 0 l
2.25 0 l
2.26 -4.72 l
0.28 0 l
1.69 0 l
1.97 -5.17 l
4.80 0 l
2.53 0 l
0.57 0 l
1.40 0 l
1.98 0 l
0.56 0 l
1.41 -7.23 l
1.41 0 l
0.85 0 l
2.53 0 l
2.26 0 l
1.69 -8.72 l
0.56 0 l
8.74 -2.15 l
1.69 -0.62 l
1.41 0 l
0.28 0 l
1.69 0 l
1.13 0 l
2.82 0 l
2.25 0 l
3.67 0 l
3.38 -1.29 l
2.25 0 l
0.85 0 l
0.28 0 l
3.95 -5.09 l
4.79 -77.24 l
5.35 0 l
0.28 -4.94 l
4.23 0 l
0.85 0 l
3.38 -22.82 l
1.69 0 l
3.10 0 l
3.95 0 l
14.37 -1.19 l
3.95 0 l
0.84 -2.50 l
29.88 0 l
5.35 0 l
11.84 0 l
31.28 0 l
5.08 0 l
13.81 0 l
23.39 0 l
1.13 0 l
40.30 -0.32 l
88.29 0 l
o
ep
%%Trailer
%%Pages: 1
%%EOF
