%!PS-Adobe-3.0 EPSF-3.0
%%DocumentNeededResources: font Helvetica
%%+ font Helvetica-Bold
%%+ font Helvetica-Oblique
%%+ font Helvetica-BoldOblique
%%+ font Symbol
%%Title: R Graphics Output
%%Creator: R Software
%%Pages: (atend)
%%BoundingBox: 0 0 576 432
%%EndComments
%%BeginProlog
/bp  { gs sRGB gs } def
% begin .ps.prolog
/gs  { gsave } bind def
/gr  { grestore } bind def
/ep  { showpage gr gr } bind def
/m   { moveto } bind def
/l  { rlineto } bind def
/np  { newpath } bind def
/cp  { closepath } bind def
/f   { fill } bind def
/o   { stroke } bind def
/c   { newpath 0 360 arc } bind def
/r   { 4 2 roll moveto 1 copy 3 -1 roll exch 0 exch rlineto 0 rlineto -1 mul 0 exch rlineto closepath } bind def
/p1  { stroke } bind def
/p2  { gsave bg fill grestore newpath } bind def
/p3  { gsave bg fill grestore stroke } bind def
/p6  { gsave bg eofill grestore newpath } bind def
/p7  { gsave bg eofill grestore stroke } bind def
/t   { 5 -2 roll moveto gsave rotate
       1 index stringwidth pop
       mul neg 0 rmoveto show grestore } bind def
/ta  { 4 -2 roll moveto gsave rotate show } bind def
/tb  { 2 -1 roll 0 rmoveto show } bind def
/cl  { grestore gsave newpath 3 index 3 index moveto 1 index
       4 -1 roll lineto  exch 1 index lineto lineto
       closepath clip newpath } bind def
/rgb { setrgbcolor } bind def
/s   { scalefont setfont } bind def
% end   .ps.prolog
/sRGB { [ /CIEBasedABC
          << /DecodeLMN
               [ { dup 0.03928 le
                        {12.92321 div}
                        {0.055 add 1.055 div 2.4 exp }
                     ifelse
                 } bind dup dup
               ]
             /MatrixLMN [0.412457 0.212673 0.019334
                         0.357576 0.715152 0.119192
                         0.180437 0.072175 0.950301]
             /WhitePoint [0.9505 1.0 1.0890]
           >>
         ] setcolorspace } bind def
/srgb { setcolor } bind def
%%IncludeResource: font Helvetica
/Helvetica findfont
dup length dict begin
  {1 index /FID ne {def} {pop pop} ifelse} forall
  /Encoding ISOLatin1Encoding def
  currentdict
  end
/Font1 exch definefont pop
%%IncludeResource: font Helvetica-Bold
/Helvetica-Bold findfont
dup length dict begin
  {1 index /FID ne {def} {pop pop} ifelse} forall
  /Encoding ISOLatin1Encoding def
  currentdict
  end
/Font2 exch definefont pop
%%IncludeResource: font Helvetica-Oblique
/Helvetica-Oblique findfont
dup length dict begin
  {1 index /FID ne {def} {pop pop} ifelse} forall
  /Encoding ISOLatin1Encoding def
  currentdict
  end
/Font3 exch definefont pop
%%IncludeResource: font Helvetica-BoldOblique
/Helvetica-BoldOblique findfont
dup length dict begin
  {1 index /FID ne {def} {pop pop} ifelse} forall
  /Encoding ISOLatin1Encoding def
  currentdict
  end
/Font4 exch definefont pop
%%IncludeResource: font Symbol
/Symbol findfont
dup length dict begin
  {1 index /FID ne {def} {pop pop} ifelse} forall
  currentdict
  end
/Font5 exch definefont pop
%%EndProlog
%%Page: 1 1
bp
59.04 73.44 545.76 372.96 cl
0 0 0 srgb
2.25 setlinewidth
[] 0 setdash
1 setlinecap
1 setlinejoin
10.00 setmiterlimit
np
77.07 84.53 m
0 5.55 l
0 5.55 l
0 5.54 l
0 5.55 l
0 5.55 l
0 5.54 l
0 5.55 l
0 5.55 l
0 5.54 l
0 5.55 l
0 5.55 l
0 5.54 l
20.48 0 l
0 5.55 l
0 5.55 l
0 5.54 l
0 5.55 l
0 5.55 l
20.49 0 l
0 5.54 l
20.48 0 l
0 5.55 l
0 5.55 l
20.49 0 l
0 5.54 l
0 5.55 l
0 5.55 l
20.48 0 l
0 5.54 l
0 5.55 l
0 5.55 l
0 5.54 l
0 5.55 l
0 5.55 l
0 5.54 l
0 5.55 l
0 5.55 l
0 5.54 l
0 5.55 l
0 5.55 l
0 5.54 l
0 5.55 l
20.49 0 l
0 5.55 l
0 5.54 l
20.48 0 l
20.49 0 l
0 5.55 l
20.48 0 l
0 5.55 l
20.49 0 l
20.48 0 l
20.48 0 l
0 5.54 l
20.49 0 l
20.48 0 l
0 5.55 l
0 5.55 l
0 5.54 l
0 5.55 l
0 5.55 l
20.49 0 l
20.48 0 l
20.49 0 l
20.48 0 l
20.49 0 l
20.48 0 l
0 5.54 l
0 5.55 l
20.49 0 l
20.48 0 l
0 5.55 l
o
0.00 0.00 576.00 432.00 cl
0 0 0 srgb
0.75 setlinewidth
[] 0 setdash
1 setlinecap
1 setlinejoin
10.00 setmiterlimit
np
527.73 73.44 m
-450.66 0 l
o
np
527.73 73.44 m
0 -7.20 l
o
np
437.60 73.44 m
0 -7.20 l
o
np
347.47 73.44 m
0 -7.20 l
o
np
257.33 73.44 m
0 -7.20 l
o
np
167.20 73.44 m
0 -7.20 l
o
np
77.07 73.44 m
0 -7.20 l
o
/Font1 findfont 12 s
77.07 47.52 (1.0) .5 0 t
167.20 47.52 (0.8) .5 0 t
257.33 47.52 (0.6) .5 0 t
347.47 47.52 (0.4) .5 0 t
437.60 47.52 (0.2) .5 0 t
527.73 47.52 (0.0) .5 0 t
np
59.04 84.53 m
0 277.34 l
o
np
59.04 84.53 m
-7.20 0 l
o
np
59.04 140.00 m
-7.20 0 l
o
np
59.04 195.47 m
-7.20 0 l
o
np
59.04 250.93 m
-7.20 0 l
o
np
59.04 306.40 m
-7.20 0 l
o
np
59.04 361.87 m
-7.20 0 l
o
41.76 84.53 (0.0) .5 90 t
41.76 140.00 (0.2) .5 90 t
41.76 195.47 (0.4) .5 90 t
41.76 250.93 (0.6) .5 90 t
41.76 306.40 (0.8) .5 90 t
41.76 361.87 (1.0) .5 90 t
np
59.04 73.44 m
486.72 0 l
0 299.52 l
-486.72 0 l
0 -299.52 l
o
0.00 0.00 576.00 432.00 cl
/Font1 findfont 12 s
0 0 0 srgb
302.40 18.72 (Sensitivity) .5 0 t
12.96 223.20 (Specificity) .5 90 t
59.04 73.44 545.76 372.96 cl
0 0 0 srgb
0.75 setlinewidth
[] 0 setdash
1 setlinecap
1 setlinejoin
10.00 setmiterlimit
np
59.04 73.44 m
486.72 299.52 l
o
/Font1 findfont 12 s
226.15 246.63 (A) 0 ta
-0.600 (UC = 0.76) tb gr
ep
%%Trailer
%%Pages: 1
%%EOF
