June 16 13:14:35 Starting VIPAR daemon:  Mon Jun 16 13:14:35 2014
June 16 13:15:05 Checking 3 sites configured in VIPAR database
June 16 13:15:05 Process 12773:thread 1 checking resource via localhost:4444
June 16 13:15:05 Process 12773:thread 2 checking resource via localhost:3333
June 16 13:15:05 Process 12773:thread 3 checking resource via localhost:5555
June 16 13:15:06 Success connecting to remote VIPAR database resource SWE_test on port 4444.
June 16 13:15:06 Success connecting to remote VIPAR database resource AUS_test on port 3333.
June 16 13:15:06 Success connecting to remote VIPAR database resource UK_test on port 5555.
June 16 13:15:35 Checking 3 sites configured in VIPAR database
June 16 13:15:35 Process 12773:thread 4 checking resource via localhost:4444
June 16 13:15:35 Process 12773:thread 5 checking resource via localhost:3333
June 16 13:15:35 Process 12773:thread 6 checking resource via localhost:5555
June 16 13:15:36 Success connecting to remote VIPAR database resource SWE_test on port 4444.
June 16 13:15:36 Success connecting to remote VIPAR database resource AUS_test on port 3333.
June 16 13:15:36 Success connecting to remote VIPAR database resource UK_test on port 5555.
June 16 13:16:05 Checking 3 sites configured in VIPAR database
June 16 13:16:05 Process 12773:thread 7 checking resource via localhost:4444
June 16 13:16:05 Process 12773:thread 8 checking resource via localhost:3333
June 16 13:16:05 Process 12773:thread 9 checking resource via localhost:5555
June 16 13:16:06 Success connecting to remote VIPAR database resource SWE_test on port 4444.
June 16 13:16:06 Success connecting to remote VIPAR database resource AUS_test on port 3333.
June 16 13:16:06 Success connecting to remote VIPAR database resource UK_test on port 5555.
June 16 13:16:35 Checking 3 sites configured in VIPAR database
June 16 13:16:35 Process 12773:thread 10 checking resource via localhost:4444
June 16 13:16:36 Process 12773:thread 11 checking resource via localhost:3333
June 16 13:16:36 Process 12773:thread 12 checking resource via localhost:5555
June 16 13:16:36 Success connecting to remote VIPAR database resource SWE_test on port 4444.
June 16 13:16:36 Success connecting to remote VIPAR database resource AUS_test on port 3333.
June 16 13:16:36 Success connecting to remote VIPAR database resource UK_test on port 5555.
June 16 13:17:05 Checking 3 sites configured in VIPAR database
June 16 13:17:05 Process 12773:thread 13 checking resource via localhost:4444
June 16 13:17:05 Process 12773:thread 14 checking resource via localhost:3333
June 16 13:17:05 Process 12773:thread 15 checking resource via localhost:5555
June 16 13:17:05 Success connecting to remote VIPAR database resource SWE_test on port 4444.
June 16 13:17:05 Success connecting to remote VIPAR database resource AUS_test on port 3333.
June 16 13:17:05 Success connecting to remote VIPAR database resource UK_test on port 5555.
June 16 13:17:16 VIPAR daemon Caught SIGTERM:  exiting gracefully
