

https://rentahouseapis.montpellier.epsi.fr/house/optionpayantes/habitation/1
	http://192.168.1.40:31011/api/v1/habitationoptionpayantes/habitation/1


https://rentahouseapis.montpellier.epsi.fr/house/images
	http://192.168.1.40:31011/api/v1/habitationimages




https://rentahouseapis.montpellier.epsi.fr/house/typehabitats/3
	http://192.168.1.40:31011/api/v1/typehabitats/3

https://rentahouseapis.montpellier.epsi.fr/house/items
	http://192.168.1.40:31011/api/v1/items


https://rentahouseapis.montpellier.epsi.fr/house/habitations/3
	http://192.168.1.40:31011/api/v1/habitations/3

--------------------------------------------------------------------------------



https://rentahouseapis.montpellier.epsi.fr/rent/locations
	http://192.168.1.40:31012/api/v1/locations

https://rentahouseapis.montpellier.epsi.fr/rent/reglements
	http://192.168.1.40:31012/api/v1/reglements

https://rentahouseapis.montpellier.epsi.fr/rent/relances
	http://192.168.1.40:31012/api/v1/relances


--------------------------------------------------------------------------------


https://rentahouseapis.montpellier.epsi.fr/customers
	http://192.168.1.40:31013/api/v1/users

https://rentahouseapis.montpellier.epsi.fr/customers-auth
	http://192.168.1.40:31013/api/auth/login
