%YAML 1.1
%TAG !u! tag:unity3d.com,2011:
--- !u!58 &5690123119387970695
CircleCollider2D:
  m_ObjectHideFlags: 0
  m_CorrespondingSourceObject: {fileID: 0}
  m_PrefabInstance: {fileID: 0}
  m_PrefabAsset: {fileID: 0}
  m_GameObject: {fileID: 3692520450374130170}
  m_Enabled: 1
  m_Density: 1
  m_Material: {fileID: 0}
  m_IsTrigger: 1
  m_UsedByEffector: 0
  m_UsedByComposite: 0
  m_Offset: {x: 0, y: 0}
  serializedVersion: 2
  m_Radius: 0.25
--- !u!1001 &1412246638365522779
PrefabInstance:
  m_ObjectHideFlags: 0
  serializedVersion: 2
  m_Modification:
    m_TransformParent: {fileID: 0}
    m_Modifications:
    - target: {fileID: 107604170797202289, guid: 0188cc9e01770da47904b7d90a28206e,
        type: 3}
      propertyPath: m_LocalPosition.x
      value: 0
      objectReference: {fileID: 0}
    - target: {fileID: 107604170797202289, guid: 0188cc9e01770da47904b7d90a28206e,
        type: 3}
      propertyPath: m_LocalPosition.y
      value: 0
      objectReference: {fileID: 0}
    - target: {fileID: 107604170797202289, guid: 0188cc9e01770da47904b7d90a28206e,
        type: 3}
      propertyPath: m_LocalPosition.z
      value: 0
      objectReference: {fileID: 0}
    - target: {fileID: 107604170797202289, guid: 0188cc9e01770da47904b7d90a28206e,
        type: 3}
      propertyPath: m_LocalRotation.x
      value: 0
      objectReference: {fileID: 0}
    - target: {fileID: 107604170797202289, guid: 0188cc9e01770da47904b7d90a28206e,
        type: 3}
      propertyPath: m_LocalRotation.y
      value: 0
      objectReference: {fileID: 0}
    - target: {fileID: 107604170797202289, guid: 0188cc9e01770da47904b7d90a28206e,
        type: 3}
      propertyPath: m_LocalRotation.z
      value: 0
      objectReference: {fileID: 0}
    - target: {fileID: 107604170797202289, guid: 0188cc9e01770da47904b7d90a28206e,
        type: 3}
      propertyPath: m_LocalRotation.w
      value: 1
      objectReference: {fileID: 0}
    - target: {fileID: 107604170797202289, guid: 0188cc9e01770da47904b7d90a28206e,
        type: 3}
      propertyPath: m_RootOrder
      value: 0
      objectReference: {fileID: 0}
    - target: {fileID: 107604170797202289, guid: 0188cc9e01770da47904b7d90a28206e,
        type: 3}
      propertyPath: m_LocalEulerAnglesHint.x
      value: 0
      objectReference: {fileID: 0}
    - target: {fileID: 107604170797202289, guid: 0188cc9e01770da47904b7d90a28206e,
        type: 3}
      propertyPath: m_LocalEulerAnglesHint.y
      value: 0
      objectReference: {fileID: 0}
    - target: {fileID: 107604170797202289, guid: 0188cc9e01770da47904b7d90a28206e,
        type: 3}
      propertyPath: m_LocalEulerAnglesHint.z
      value: 0
      objectReference: {fileID: 0}
    - target: {fileID: 2352912126595457697, guid: 0188cc9e01770da47904b7d90a28206e,
        type: 3}
      propertyPath: m_Name
      value: enemy 1
      objectReference: {fileID: 0}
    - target: {fileID: 2659967056038019630, guid: 0188cc9e01770da47904b7d90a28206e,
        type: 3}
      propertyPath: _maxHealth
      value: 3
      objectReference: {fileID: 0}
    - target: {fileID: 2659967056038019630, guid: 0188cc9e01770da47904b7d90a28206e,
        type: 3}
      propertyPath: _moveSpeed
      value: 2
      objectReference: {fileID: 0}
    m_RemovedComponents: []
  m_SourcePrefab: {fileID: 100100000, guid: 0188cc9e01770da47904b7d90a28206e, type: 3}
--- !u!1 &3692520450374130170 stripped
GameObject:
  m_CorrespondingSourceObject: {fileID: 2352912126595457697, guid: 0188cc9e01770da47904b7d90a28206e,
    type: 3}
  m_PrefabInstance: {fileID: 1412246638365522779}
  m_PrefabAsset: {fileID: 0}
