{
  "_comment": "Build with `packer build ubuntu-16.04.json`",
  "builders": [
    {
      "type": "qemu",
      "accelerator": "kvm",
      "qemu_binary": "kvm",
      "vm_name": "{{ user `vm_name` }}",
      "disk_size": "{{ user `disk_size` }}",
      "disk_interface": "virtio",
      "format": "qcow2",
      "headless": "{{ user `headless` }}",
      "net_device": "virtio-net",
      "iso_urls": [
        "{{ user `iso_path` }}/{{ user `iso_name` }}",
        "{{ user `iso_url` }}"
      ],
      "iso_checksum": "{{ user `iso_checksum` }}",
      "iso_checksum_type": "{{ user `iso_checksum_type` }}",
      "http_directory": "http",
      "boot_command": [
        "<enter><wait><f6><esc><bs><bs><bs><bs><bs><bs><bs><bs><bs><bs><bs><bs><bs><bs><bs><bs><bs>",
        "<bs><bs><bs><bs><bs><bs><bs><bs><bs><bs><bs><bs><bs><bs><bs><bs><bs><bs><bs><bs><bs><bs>",
        "<bs><bs><bs><bs><bs><bs><bs><bs><bs><bs><bs><bs><bs><bs><bs><bs><bs><bs><bs><bs><bs><bs>",
        "<bs><bs><bs><bs><bs><bs><bs><bs><bs><bs><bs><bs><bs><bs><bs><bs><bs><bs><bs><bs><bs><bs>",
        "/install/vmlinuz<wait>",
        " auto=true<wait>",
        " priority=critical<wait>",
        " initrd=/install/initrd.gz<wait>",
        " preseed/url=http://{{ .HTTPIP }}:{{ .HTTPPort }}/{{ user `preseed` }}<wait>",
        " -- <wait>",
        "<enter><wait>"
      ],
      "boot_wait": "40s",
      "shutdown_command": "{{ user `shutdown_command` }}",
      "ssh_password": "{{ user `ssh_password` }}",
      "ssh_username": "{{ user `ssh_username` }}",
      "ssh_port": "{{ user `ssh_port` }}",
      "ssh_wait_timeout": "{{ user `ssh_wait_timeout` }}",
      "output_directory": "builds/libvirt/{{user `vm_name`}}/{{user `version`}}",
      "qemuargs": [
        [ "-m", "{{ user `memory` }}M" ],
        [ "-smp", "{{ user `cpus` }}" ]
      ]
    }
  ],
  "variables": {
    "vm_name":           "template-ubuntu-16.04-x64-server.qcow2",
    "version":           "1.0.5",
    "cpus":              "2",
    "memory":            "2048",
    "disk_size":         "10240",
    "headless":          "true",
    "iso_checksum":      "737ae7041212c628de5751d15c3016058b0e833fdc32e7420209b76ca3d0a535",
    "iso_checksum_type": "sha256",
    "iso_name":          "ubuntu-16.04.2-server-amd64.iso",
    "iso_path":          "iso",
    "iso_url":           "http://releases.ubuntu.com/16.04/ubuntu-16.04.2-server-amd64.iso",
    "preseed":           "preseed.cfg",
    "shutdown_command":  "echo 'sysadmin'|sudo -S shutdown -P now",
    "ssh_password":      "sysadmin",
    "ssh_username":      "sysadmin",
    "ssh_port":          "22",
    "ssh_wait_timeout":  "20m"
  }
}
