<svg width="40" height="40" viewBox="0 0 40 40" fill="none" xmlns="http://www.w3.org/2000/svg">
<g clip-path="url(#clip0_169_1165)">
<path d="M20 2.5C20 1.83696 20.2634 1.20107 20.7322 0.732233C21.2011 0.263392 21.837 0 22.5 0L37.5 0C38.163 0 38.7989 0.263392 39.2678 0.732233C39.7366 1.20107 40 1.83696 40 2.5V37.5C40 38.163 39.7366 38.7989 39.2678 39.2678C38.7989 39.7366 38.163 40 37.5 40H22.5C21.837 40 21.2011 39.7366 20.7322 39.2678C20.2634 38.7989 20 38.163 20 37.5V2.5ZM22.5 36.25C22.5 36.5815 22.6317 36.8995 22.8661 37.1339C23.1005 37.3683 23.4185 37.5 23.75 37.5C24.0815 37.5 24.3995 37.3683 24.6339 37.1339C24.8683 36.8995 25 36.5815 25 36.25C25 35.9185 24.8683 35.6005 24.6339 35.3661C24.3995 35.1317 24.0815 35 23.75 35C23.4185 35 23.1005 35.1317 22.8661 35.3661C22.6317 35.6005 22.5 35.9185 22.5 36.25ZM27.5 36.25C27.5 36.5815 27.6317 36.8995 27.8661 37.1339C28.1005 37.3683 28.4185 37.5 28.75 37.5C29.0815 37.5 29.3995 37.3683 29.6339 37.1339C29.8683 36.8995 30 36.5815 30 36.25C30 35.9185 29.8683 35.6005 29.6339 35.3661C29.3995 35.1317 29.0815 35 28.75 35C28.4185 35 28.1005 35.1317 27.8661 35.3661C27.6317 35.6005 27.5 35.9185 27.5 36.25ZM23.75 2.5C23.4185 2.5 23.1005 2.6317 22.8661 2.86612C22.6317 3.10054 22.5 3.41848 22.5 3.75C22.5 4.08152 22.6317 4.39946 22.8661 4.63388C23.1005 4.8683 23.4185 5 23.75 5H36.25C36.5815 5 36.8995 4.8683 37.1339 4.63388C37.3683 4.39946 37.5 4.08152 37.5 3.75C37.5 3.41848 37.3683 3.10054 37.1339 2.86612C36.8995 2.6317 36.5815 2.5 36.25 2.5H23.75ZM22.5 8.75C22.5 9.08152 22.6317 9.39946 22.8661 9.63388C23.1005 9.8683 23.4185 10 23.75 10H36.25C36.5815 10 36.8995 9.8683 37.1339 9.63388C37.3683 9.39946 37.5 9.08152 37.5 8.75C37.5 8.41848 37.3683 8.10054 37.1339 7.86612C36.8995 7.6317 36.5815 7.5 36.25 7.5H23.75C23.4185 7.5 23.1005 7.6317 22.8661 7.86612C22.6317 8.10054 22.5 8.41848 22.5 8.75ZM3.75 5C2.75544 5 1.80161 5.39509 1.09835 6.09835C0.395088 6.80161 0 7.75544 0 8.75L0 26.25C0 27.2446 0.395088 28.1984 1.09835 28.9017C1.80161 29.6049 2.75544 30 3.75 30H15V35H13.75C13.4185 35 13.1005 35.1317 12.8661 35.3661C12.6317 35.6005 12.5 35.9185 12.5 36.25C12.5 36.5815 12.6317 36.8995 12.8661 37.1339C13.1005 37.3683 13.4185 37.5 13.75 37.5H17.5V27.5H3.75C3.41848 27.5 3.10054 27.3683 2.86612 27.1339C2.6317 26.8995 2.5 26.5815 2.5 26.25V8.75C2.5 8.41848 2.6317 8.10054 2.86612 7.86612C3.10054 7.6317 3.41848 7.5 3.75 7.5H17.5V5H3.75Z" fill="#D9CBBA"/>
</g>
<defs>
<clipPath id="clip0_169_1165">
<rect width="40" height="40" fill="white"/>
</clipPath>
</defs>
</svg>
