<svg width="40" height="40" viewBox="0 0 40 40" fill="none" xmlns="http://www.w3.org/2000/svg">
<g id="toggle-on 6" clip-path="url(#clip0_92_1694)">
<path id="Vector" d="M27.5 10C30.1522 10 32.6957 11.0536 34.5711 12.9289C36.4464 14.8043 37.5 17.3478 37.5 20C37.5 22.6522 36.4464 25.1957 34.5711 27.0711C32.6957 28.9464 30.1522 30 27.5 30H20C21.5536 28.8367 22.8145 27.3272 23.6825 25.5912C24.5504 23.8553 25.0016 21.9408 25 20C25.0016 18.0592 24.5504 16.1447 23.6825 14.4088C22.8145 12.6728 21.5536 11.1633 20 10H27.5ZM12.5 30C9.84783 30 7.3043 28.9464 5.42893 27.0711C3.55357 25.1957 2.5 22.6522 2.5 20C2.5 17.3478 3.55357 14.8043 5.42893 12.9289C7.3043 11.0536 9.84783 10 12.5 10C15.1522 10 17.6957 11.0536 19.5711 12.9289C21.4464 14.8043 22.5 17.3478 22.5 20C22.5 22.6522 21.4464 25.1957 19.5711 27.0711C17.6957 28.9464 15.1522 30 12.5 30ZM0 20C0 23.3152 1.31696 26.4946 3.66117 28.8388C6.00537 31.183 9.18479 32.5 12.5 32.5H27.5C30.8152 32.5 33.9946 31.183 36.3388 28.8388C38.683 26.4946 40 23.3152 40 20C40 16.6848 38.683 13.5054 36.3388 11.1612C33.9946 8.81696 30.8152 7.5 27.5 7.5H12.5C9.18479 7.5 6.00537 8.81696 3.66117 11.1612C1.31696 13.5054 0 16.6848 0 20Z" fill="black"/>
</g>
<defs>
<clipPath id="clip0_92_1694">
<rect width="40" height="40" fill="white"/>
</clipPath>
</defs>
</svg>
