/Users/apple/Documents/Source/maven_docker/src/test/java/TestCase/TestCaseLocal.java
/Users/apple/Documents/Source/maven_docker/src/test/java/TestCase/TestCaseSeleniumGrid.java
/Users/apple/Documents/Source/maven_docker/src/test/java/TestCase/TestCaseDocker.java
/Users/apple/Documents/Source/maven_docker/src/test/java/TestCase/TestCaseBS.java
/Users/apple/Documents/Source/maven_docker/src/test/java/TestCase/TestCaseSL.java
