<?xml version="1.0" encoding="UTF-8"?>
<testng-results ignored="0" total="2" passed="2" failed="0" skipped="0">
  <reporter-output>
  </reporter-output>
  <suite started-at="2021-08-18T09:46:36 ICT" name="Suite" finished-at="2021-08-18T09:47:09 ICT" duration-ms="33399">
    <groups>
    </groups>
    <test started-at="2021-08-18T09:46:36 ICT" name="Run On Chrome" finished-at="2021-08-18T09:47:09 ICT" duration-ms="33399">
      <class name="TestCase.TestCaseLocal">
        <test-method is-config="true" signature="BeforMethod(java.lang.String,java.lang.String)[pri:0, instance:TestCase.TestCaseLocal@350d3f4d]" started-at="2021-08-18T09:46:36 ICT" name="BeforMethod" finished-at="2021-08-18T09:46:50 ICT" duration-ms="13962" status="PASS">
          <params>
            <param index="0">
              <value>
                <![CDATA[chrome]]>
              </value>
            </param>
            <param index="1">
              <value>
                <![CDATA[http://live.demoguru99.com/]]>
              </value>
            </param>
          </params>
          <reporter-output>
          </reporter-output>
        </test-method> <!-- BeforMethod -->
        <test-method signature="Register_Account()[pri:1, instance:TestCase.TestCaseLocal@350d3f4d]" started-at="2021-08-18T09:46:50 ICT" name="Register_Account" finished-at="2021-08-18T09:46:55 ICT" duration-ms="5425" status="PASS">
          <reporter-output>
          </reporter-output>
        </test-method> <!-- Register_Account -->
        <test-method is-config="true" signature="AfterMethod()[pri:0, instance:TestCase.TestCaseLocal@350d3f4d]" started-at="2021-08-18T09:46:55 ICT" name="AfterMethod" finished-at="2021-08-18T09:46:56 ICT" duration-ms="193" status="PASS">
          <reporter-output>
          </reporter-output>
        </test-method> <!-- AfterMethod -->
        <test-method is-config="true" signature="BeforMethod(java.lang.String,java.lang.String)[pri:0, instance:TestCase.TestCaseLocal@350d3f4d]" started-at="2021-08-18T09:46:56 ICT" name="BeforMethod" finished-at="2021-08-18T09:47:05 ICT" duration-ms="9829" status="PASS">
          <params>
            <param index="0">
              <value>
                <![CDATA[chrome]]>
              </value>
            </param>
            <param index="1">
              <value>
                <![CDATA[http://live.demoguru99.com/]]>
              </value>
            </param>
          </params>
          <reporter-output>
          </reporter-output>
        </test-method> <!-- BeforMethod -->
        <test-method signature="Login_Account()[pri:2, instance:TestCase.TestCaseLocal@350d3f4d]" started-at="2021-08-18T09:47:05 ICT" name="Login_Account" finished-at="2021-08-18T09:47:09 ICT" duration-ms="3592" status="PASS">
          <reporter-output>
          </reporter-output>
        </test-method> <!-- Login_Account -->
        <test-method is-config="true" signature="AfterMethod()[pri:0, instance:TestCase.TestCaseLocal@350d3f4d]" started-at="2021-08-18T09:47:09 ICT" name="AfterMethod" finished-at="2021-08-18T09:47:09 ICT" duration-ms="138" status="PASS">
          <reporter-output>
          </reporter-output>
        </test-method> <!-- AfterMethod -->
      </class> <!-- TestCase.TestCaseLocal -->
    </test> <!-- Run On Chrome -->
  </suite> <!-- Suite -->
</testng-results>
