Core/PageObjectManage.class
PageUI/LoginPageUI.class
PageObject/RegisterPageObject.class
PageUI/HomePageUI.class
Util/GlobalContants.class
PageObject/LoginPageObject.class
Util/DataTest.class
PageObject/HomePageObject.class
PageUI/RegisterPageUI.class
PageUI/MyDashBoardPageUI.class
Core/BasePage.class
Core/BaseTest.class
PageObject/MyDashBoardPageObject.class
