<?xml version="1.0" encoding="UTF-8" standalone="no"?>
<svg
   version="1.1"
   viewBox="0 0 128 128"
   id="svg37"
   sodipodi:docname="table_sql_view.svg"
   width="128"
   height="128"
   inkscape:version="1.1.2 (0a00cf5339, 2022-02-04, custom)"
   xmlns:inkscape="http://www.inkscape.org/namespaces/inkscape"
   xmlns:sodipodi="http://sodipodi.sourceforge.net/DTD/sodipodi-0.dtd"
   xmlns="http://www.w3.org/2000/svg"
   xmlns:svg="http://www.w3.org/2000/svg">
  <sodipodi:namedview
     id="namedview39"
     pagecolor="#505050"
     bordercolor="#ffffff"
     borderopacity="1"
     inkscape:pageshadow="0"
     inkscape:pageopacity="0"
     inkscape:pagecheckerboard="1"
     showgrid="false"
     inkscape:zoom="2.1640625"
     inkscape:cx="60.303249"
     inkscape:cy="0.46209386"
     inkscape:window-width="1920"
     inkscape:window-height="1017"
     inkscape:window-x="-1928"
     inkscape:window-y="-8"
     inkscape:window-maximized="1"
     inkscape:current-layer="g940" />
  <defs
     id="defs7">
    <linearGradient
       id="def0"
       x1="0.49999499"
       x2="0.49999499"
       y1="1.63487e-07"
       y2="1.00001">
      <stop
         offset="0"
         stop-color="#B3E2FF"
         id="stop2" />
      <stop
         offset="1"
         stop-color="#99CCFF"
         id="stop4" />
    </linearGradient>
    <style
       id="style825">.cls-1{fill:#9e9da5;}.cls-2{fill:#2eb1b7;}.cls-3{fill:#5dc6d1;}.cls-4{fill:#eaeaea;}.cls-5{fill:#6c2e7c;}</style>
  </defs>
  <g
     id="g35">
    <g
       id="g1031"
       transform="translate(6.238265,20.6787)">
      <path
         d="M 115.52347,86.642599 H 0 V 0 h 115.52347 z"
         fill="#0099FF"
         id="path9"
         style="fill:#1a1a1a;stroke-width:0.902527" />
      <path
         d="M 1.2033664,1.2033755 H 114.3204 V 85.43926 H 1.2033664 Z"
         fill="url(#def0)"
         id="path11"
         style="fill:#1a1a1a;stroke-width:0.902527" />
      <path
         d="M 2.4067419,2.4067329 H 113.11643 V 84.23583 H 2.4067419 Z"
         fill="#ffffff"
         id="path13"
         style="stroke-width:0.902527" />
      <path
         d="M 113.11643,13.237094 H 2.4067419 V 2.4067329 H 113.11643 Z"
         fill="#DEFFFF"
         id="path15"
         style="fill:#2197f3;fill-opacity:1;stroke-width:0.902527" />
      <path
         d="M 2.4067419,13.237094 H 113.11643 v -1.20343 H 2.4067419 Z"
         fill="#B4E2FF"
         id="path17"
         style="fill:#1a1a1a;stroke-width:0.902527" />
      <path
         d="m 36.101083,84.23583 h 1.203339 V 2.4067329 h -1.203339 z"
         fill="#B4E2FF"
         id="path19"
         style="fill:#1a1a1a;stroke-width:0.902527" />
      <path
         d="m 78.219043,84.23583 h 1.20334 V 2.4067329 h -1.20334 z"
         fill="#B4E2FF"
         id="path21"
         style="fill:#1a1a1a;stroke-width:0.902527" />
      <path
         d="M 2.4067419,25.270758 H 113.11643 V 24.067419 H 2.4067419 Z"
         fill="#B4E2FF"
         id="path23"
         style="fill:#1a1a1a;stroke-width:0.902527" />
      <path
         d="M 2.4067419,37.304422 H 113.11643 V 36.101083 H 2.4067419 Z"
         fill="#B4E2FF"
         id="path25"
         style="fill:#1a1a1a;stroke-width:0.902527" />
      <path
         d="M 2.4067419,49.338177 H 113.11643 v -1.20343 H 2.4067419 Z"
         fill="#B4E2FF"
         id="path27"
         style="fill:#1a1a1a;stroke-width:0.902527" />
      <path
         d="M 2.4067419,61.371841 H 113.11643 V 60.167238 H 2.4067419 Z"
         fill="#B4E2FF"
         id="path29"
         style="fill:#1a1a1a;stroke-width:0.902527" />
      <path
         d="M 2.4067419,73.405505 H 113.11643 V 72.202166 H 2.4067419 Z"
         fill="#B4E2FF"
         id="path31"
         style="fill:#1a1a1a;stroke-width:0.902527" />
      <g
         id="g940"
         transform="matrix(3.0118947,0,0,3.0118947,90.786242,-46.115844)">
        <g
           id="Icons" />
        <g
           id="g1357"
           transform="translate(-15.035452,25.468215)">
          <path
             class="cls-1"
             d="m 17.607,14.79 4.8,4.8 a 1.9940411,1.9940411 0 0 1 -2.82,2.82 l -4.8,-4.8 z"
             id="path829" />
          <path
             class="cls-2"
             d="M 19,10 A 9,9 0 0 1 1,10 8.637,8.637 0 0 1 1.36,7.5 8.992,8.992 0 0 1 18.64,7.5 8.637,8.637 0 0 1 19,10 Z"
             id="path831"
             style="fill:#2eb1b7;fill-opacity:1" />
          <ellipse
             class="cls-3"
             cx="10"
             cy="7.5"
             rx="8.6400003"
             ry="6.5"
             id="ellipse833"
             style="fill:#5dc6d1;fill-opacity:1" />
          <path
             class="cls-4"
             d="M 5,11 A 1,1 0 0 1 4,10 6.006,6.006 0 0 1 10,4 1,1 0 0 1 10,6 4,4 0 0 0 6,10 1,1 0 0 1 5,11 Z"
             id="path835" />
          <g
             data-name="Layer 4"
             id="Layer_4">
            <path
               class="cls-5"
               d="m 18.856,14.624 a 10.022,10.022 0 1 0 -4.234,4.234 l 4.254,4.255 a 2.9942454,2.9942454 0 1 0 4.239,-4.23 z M 2,10 a 8,8 0 1 1 8,8 8.009,8.009 0 0 1 -8,-8 z m 19.7,11.708 a 1,1 0 0 1 -1.4,0 L 16.333,17.74 a 10.092,10.092 0 0 0 1.4,-1.406 l 3.972,3.966 a 0.976,0.976 0 0 1 -0.009,1.407 z"
               id="path838"
               style="fill:#1a1a1a" />
          </g>
        </g>
      </g>
    </g>
  </g>
  <style
     type="text/css"
     id="style2">
	.st0{fill-rule:evenodd;clip-rule:evenodd;}
	.st1{fill-rule:evenodd;clip-rule:evenodd;fill:#7ACED7;}
</style>
</svg>
