<?xml version="1.0" encoding="UTF-8" standalone="no"?>
<svg
   version="1.1"
   viewBox="0 0 128 128"
   id="svg37"
   sodipodi:docname="table_sql.svg"
   width="128"
   height="128"
   inkscape:version="1.1.2 (0a00cf5339, 2022-02-04, custom)"
   xmlns:inkscape="http://www.inkscape.org/namespaces/inkscape"
   xmlns:sodipodi="http://sodipodi.sourceforge.net/DTD/sodipodi-0.dtd"
   xmlns="http://www.w3.org/2000/svg"
   xmlns:svg="http://www.w3.org/2000/svg">
  <sodipodi:namedview
     id="namedview39"
     pagecolor="#505050"
     bordercolor="#ffffff"
     borderopacity="1"
     inkscape:pageshadow="0"
     inkscape:pageopacity="0"
     inkscape:pagecheckerboard="1"
     showgrid="false"
     inkscape:zoom="2.1640625"
     inkscape:cx="60.303249"
     inkscape:cy="0.46209386"
     inkscape:window-width="1920"
     inkscape:window-height="1017"
     inkscape:window-x="-1928"
     inkscape:window-y="-8"
     inkscape:window-maximized="1"
     inkscape:current-layer="g1031" />
  <defs
     id="defs7">
    <linearGradient
       id="def0"
       x1="0.49999499"
       x2="0.49999499"
       y1="1.63487e-07"
       y2="1.00001">
      <stop
         offset="0"
         stop-color="#B3E2FF"
         id="stop2" />
      <stop
         offset="1"
         stop-color="#99CCFF"
         id="stop4" />
    </linearGradient>
  </defs>
  <g
     id="g35">
    <g
       id="g1031"
       transform="translate(6.238265,20.6787)">
      <path
         d="M 115.52347,86.642599 H 0 V 0 h 115.52347 z"
         fill="#0099FF"
         id="path9"
         style="fill:#1a1a1a;stroke-width:0.902527" />
      <path
         d="M 1.2033664,1.2033755 H 114.3204 V 85.43926 H 1.2033664 Z"
         fill="url(#def0)"
         id="path11"
         style="fill:#1a1a1a;stroke-width:0.902527" />
      <path
         d="M 2.4067419,2.4067329 H 113.11643 V 84.23583 H 2.4067419 Z"
         fill="#ffffff"
         id="path13"
         style="stroke-width:0.902527" />
      <path
         d="M 113.11643,13.237094 H 2.4067419 V 2.4067329 H 113.11643 Z"
         fill="#DEFFFF"
         id="path15"
         style="fill:#2197f3;fill-opacity:1;stroke-width:0.902527" />
      <path
         d="M 2.4067419,13.237094 H 113.11643 v -1.20343 H 2.4067419 Z"
         fill="#B4E2FF"
         id="path17"
         style="fill:#1a1a1a;stroke-width:0.902527" />
      <path
         d="m 36.101083,84.23583 h 1.203339 V 2.4067329 h -1.203339 z"
         fill="#B4E2FF"
         id="path19"
         style="fill:#1a1a1a;stroke-width:0.902527" />
      <path
         d="m 78.219043,84.23583 h 1.20334 V 2.4067329 h -1.20334 z"
         fill="#B4E2FF"
         id="path21"
         style="fill:#1a1a1a;stroke-width:0.902527" />
      <path
         d="M 2.4067419,25.270758 H 113.11643 V 24.067419 H 2.4067419 Z"
         fill="#B4E2FF"
         id="path23"
         style="fill:#1a1a1a;stroke-width:0.902527" />
      <path
         d="M 2.4067419,37.304422 H 113.11643 V 36.101083 H 2.4067419 Z"
         fill="#B4E2FF"
         id="path25"
         style="fill:#1a1a1a;stroke-width:0.902527" />
      <path
         d="M 2.4067419,49.338177 H 113.11643 v -1.20343 H 2.4067419 Z"
         fill="#B4E2FF"
         id="path27"
         style="fill:#1a1a1a;stroke-width:0.902527" />
      <path
         d="M 2.4067419,61.371841 H 113.11643 V 60.167238 H 2.4067419 Z"
         fill="#B4E2FF"
         id="path29"
         style="fill:#1a1a1a;stroke-width:0.902527" />
      <path
         d="M 2.4067419,73.405505 H 113.11643 V 72.202166 H 2.4067419 Z"
         fill="#B4E2FF"
         id="path31"
         style="fill:#1a1a1a;stroke-width:0.902527" />
    </g>
  </g>
</svg>
