<?xml version="1.0" encoding="UTF-8" standalone="no"?>
<svg
   enable-background="new 0 0 48 48"
   height="48px"
   id="Layer_1"
   version="1.1"
   viewBox="0 0 48 48"
   width="48px"
   xml:space="preserve"
   sodipodi:docname="mobilephone2.svg"
   inkscape:version="1.1.2 (0a00cf5339, 2022-02-04, custom)"
   xmlns:inkscape="http://www.inkscape.org/namespaces/inkscape"
   xmlns:sodipodi="http://sodipodi.sourceforge.net/DTD/sodipodi-0.dtd"
   xmlns="http://www.w3.org/2000/svg"
   xmlns:svg="http://www.w3.org/2000/svg"><defs
     id="defs7" /><sodipodi:namedview
     id="namedview5"
     pagecolor="#505050"
     bordercolor="#ffffff"
     borderopacity="1"
     inkscape:pageshadow="0"
     inkscape:pageopacity="0"
     inkscape:pagecheckerboard="1"
     showgrid="false"
     inkscape:zoom="8.65625"
     inkscape:cx="37.140794"
     inkscape:cy="41.126354"
     inkscape:window-width="1920"
     inkscape:window-height="1017"
     inkscape:window-x="-1928"
     inkscape:window-y="-8"
     inkscape:window-maximized="1"
     inkscape:current-layer="Layer_1" /><path
     style="fill:#666666;stroke-width:13.396;stroke-linejoin:round;paint-order:markers fill stroke;fill-opacity:1"
     d="m 13,39 v 4 c 0,1.104 0.896,2 2,2 h 18 c 1.104,0 2,-0.896 2,-2 v -4 z"
     id="path999" /><path
     style="fill:#666666;stroke-width:13.396;stroke-linejoin:round;paint-order:markers fill stroke;fill-opacity:1"
     d="M 15,3 C 13.896,3 13,3.896 13,5 V 9 H 35 V 5 C 35,3.896 34.104,3 33,3 Z"
     id="path977" /><path
     style="fill:#666666;stroke-width:13.396;stroke-linejoin:round;paint-order:markers fill stroke;fill-opacity:1"
     d="M 13,11 V 37 H 35 V 11 Z"
     id="path981" /><path
     style="fill:#ffffff;stroke-width:13.396;stroke-linejoin:round;paint-order:markers fill stroke"
     d="m 24,40 c 1.104,0 2,0.896 2,2 0,1.104 -0.896,2 -2,2 -1.104,0 -2,-0.896 -2,-2 0,-1.104 0.896,-2 2,-2 z"
     id="path1001" /><path
     style="fill:#ffffff;stroke-width:13.396;stroke-linejoin:round;paint-order:markers fill stroke"
     d="m 23,28 h 2 c 0.553,0 1,0.447 1,1 v 2 c 0,0.553 -0.447,1 -1,1 h -2 c -0.553,0 -1,-0.447 -1,-1 v -2 c 0,-0.553 0.447,-1 1,-1 z"
     id="path997" /><path
     style="fill:#ffffff;stroke-width:13.396;stroke-linejoin:round;paint-order:markers fill stroke"
     d="m 17,28 h 2 c 0.553,0 1,0.447 1,1 v 2 c 0,0.553 -0.447,1 -1,1 h -2 c -0.553,0 -1,-0.447 -1,-1 v -2 c 0,-0.553 0.447,-1 1,-1 z"
     id="path995" /><path
     style="fill:#ffffff;stroke-width:13.396;stroke-linejoin:round;paint-order:markers fill stroke"
     d="m 29,21 h 2 c 0.553,0 1,0.448 1,1 v 2 c 0,0.553 -0.447,1 -1,1 h -2 c -0.553,0 -1,-0.447 -1,-1 v -2 c 0,-0.552 0.447,-1 1,-1 z"
     id="path993" /><path
     style="fill:#ffffff;stroke-width:13.396;stroke-linejoin:round;paint-order:markers fill stroke"
     d="m 23,21 h 2 c 0.553,0 1,0.448 1,1 v 2 c 0,0.553 -0.447,1 -1,1 h -2 c -0.553,0 -1,-0.447 -1,-1 v -2 c 0,-0.552 0.447,-1 1,-1 z"
     id="path991" /><path
     style="fill:#ffffff;stroke-width:13.396;stroke-linejoin:round;paint-order:markers fill stroke"
     d="m 17,21 h 2 c 0.553,0 1,0.448 1,1 v 2 c 0,0.553 -0.447,1 -1,1 h -2 c -0.553,0 -1,-0.447 -1,-1 v -2 c 0,-0.552 0.447,-1 1,-1 z"
     id="path989" /><path
     style="fill:#ffffff;stroke-width:13.396;stroke-linejoin:round;paint-order:markers fill stroke"
     d="m 29,14 h 2 c 0.553,0 1,0.448 1,1 v 2 c 0,0.552 -0.447,1 -1,1 h -2 c -0.553,0 -1,-0.448 -1,-1 v -2 c 0,-0.552 0.447,-1 1,-1 z"
     id="path987" /><path
     style="fill:#ffffff;stroke-width:13.396;stroke-linejoin:round;paint-order:markers fill stroke"
     d="m 23,14 h 2 c 0.553,0 1,0.448 1,1 v 2 c 0,0.552 -0.447,1 -1,1 h -2 c -0.553,0 -1,-0.448 -1,-1 v -2 c 0,-0.552 0.447,-1 1,-1 z"
     id="path985" /><path
     style="fill:#ffffff;stroke-width:13.396;stroke-linejoin:round;paint-order:markers fill stroke"
     d="m 17,14 h 2 c 0.553,0 1,0.448 1,1 v 2 c 0,0.552 -0.447,1 -1,1 h -2 c -0.553,0 -1,-0.448 -1,-1 v -2 c 0,-0.552 0.447,-1 1,-1 z"
     id="path983" /><path
     style="fill:#ffffff;stroke-width:13.396;stroke-linejoin:round;paint-order:markers fill stroke"
     d="m 21,5 h 6 c 0.553,0 1,0.448 1,1 0,0.552 -0.447,1 -1,1 H 21 C 20.447,7 20,6.552 20,6 20,5.448 20.447,5 21,5 Z"
     id="path979" /><path
     clip-rule="evenodd"
     d="M 33,47 H 15 c -2.209,0 -4,-1.791 -4,-4 V 4.9999995 c 0,-2.209 1.791,-4 4,-4 h 18 c 2.209,0 4,1.791 4,4 V 43 c 0,2.209 -1.791,4 -4,4 z M 35,4.9999995 c 0,-1.104 -0.896,-2 -2,-2 H 15 c -1.104,0 -2,0.896 -2,2 V 9 H 35 Z M 35,11 H 13 v 26 h 22 z m 0,28 H 13 v 4 c 0,1.104 0.896,2 2,2 h 18 c 1.104,0 2,-0.896 2,-2 z"
     fill-rule="evenodd"
     id="path2"
     style="fill:#b3b3b3;fill-opacity:1"
     sodipodi:nodetypes="sssssssssssssccscccccccssssc" /></svg>
