<?xml version="1.0" encoding="UTF-8" standalone="no"?>
<!-- Uploaded to: SVG Repo, www.svgrepo.com, Transformed by: SVG Repo Mixer Tools -->

<svg
   xmlns:dc="http://purl.org/dc/elements/1.1/"
   xmlns:cc="http://creativecommons.org/ns#"
   xmlns:rdf="http://www.w3.org/1999/02/22-rdf-syntax-ns#"
   xmlns:svg="http://www.w3.org/2000/svg"
   xmlns="http://www.w3.org/2000/svg"
   xmlns:sodipodi="http://sodipodi.sourceforge.net/DTD/sodipodi-0.dtd"
   xmlns:inkscape="http://www.inkscape.org/namespaces/inkscape"
   width="800px"
   height="800px"
   viewBox="0 -0.08 103.51 103.51"
   version="1.1"
   id="svg38"
   sodipodi:docname="earth_view.svg"
   inkscape:version="0.92.5 (2060ec1f9f, 2020-04-08)">
  <metadata
     id="metadata3683">
    <rdf:RDF>
      <cc:Work
         rdf:about="">
        <dc:format>image/svg+xml</dc:format>
        <dc:type
           rdf:resource="http://purl.org/dc/dcmitype/StillImage" />
      </cc:Work>
    </rdf:RDF>
  </metadata>
  <sodipodi:namedview
     id="namedview40"
     pagecolor="#505050"
     bordercolor="#ffffff"
     borderopacity="1"
     inkscape:pageshadow="0"
     inkscape:pageopacity="0"
     inkscape:pagecheckerboard="1"
     showgrid="false"
     inkscape:zoom="0.519375"
     inkscape:cx="25.992779"
     inkscape:cy="429.36221"
     inkscape:window-width="1920"
     inkscape:window-height="980"
     inkscape:window-x="0"
     inkscape:window-y="27"
     inkscape:window-maximized="1"
     inkscape:current-layer="Earth" />
  <defs
     id="defs8">
    <clipPath
       id="clip-path">
      <circle
         id="Ellipse_23"
         data-name="Ellipse 23"
         cx="51.203"
         cy="51.203"
         r="51.203"
         transform="translate(565.305 40.759)"
         fill="none" />
    </clipPath>
    <clipPath
       id="clip-path-2">
      <circle
         id="Ellipse_24"
         data-name="Ellipse 24"
         cx="51.203"
         cy="51.203"
         r="51.203"
         transform="translate(564.201 39.808)"
         fill="none" />
    </clipPath>
    <clipPath
       id="clip-path-3">
      <path
         id="Rectangle_7"
         data-name="Rectangle 7"
         d="M2.488,0h16.4a2.488,2.488,0,0,1,2.488,2.488v.255A10.688,10.688,0,0,1,10.688,13.431h0A10.688,10.688,0,0,1,0,2.743V2.488A2.488,2.488,0,0,1,2.488,0Z"
         transform="translate(627.195 131.237) rotate(-180)"
         fill="none" />
    </clipPath>
    <style
       id="style825">.cls-1{fill:#9e9da5;}.cls-2{fill:#2eb1b7;}.cls-3{fill:#5dc6d1;}.cls-4{fill:#eaeaea;}.cls-5{fill:#6c2e7c;}</style>
  </defs>
  <g
     id="Earth"
     transform="translate(-564.201 -39.808)">
    <g
       id="g1863"
       transform="translate(0.8011371)">
      <circle
         id="Ellipse_18"
         data-name="Ellipse 18"
         cx="615.15485"
         cy="90.761879"
         r="44.227596"
         fill="#5baed1"
         style="stroke-width:0.86377" />
      <g
         id="Group_26"
         data-name="Group 26"
         transform="matrix(0.86376964,0,0,0.86376964,83.587589,12.14934)">
        <g
           id="Group_25"
           data-name="Group 25"
           clip-path="url(#clip-path-2)">
          <path
             id="Path_23"
             data-name="Path 23"
             d="m 608.021,40.339 c 0,0 4.239,12.461 1.53,16.691 -2.709,4.23 -6.508,10.277 -12.583,11.015 -6.075,0.738 -8.483,-3.429 -12.7,0.761 -4.217,4.19 -5.718,9.971 -4.514,13.25 a 106.467,106.467 0 0 0 5.417,10.586 c 0,0 0.6,7.785 -0.3,9.267 -0.9,1.482 -0.3,3.8 -8.427,6.527 -8.127,2.727 -24.075,-3.522 -24.075,-3.522 L 542.44,57.03 584.874,29.058 Z"
             fill="#9ed32b" />
          <path
             id="Path_24"
             data-name="Path 24"
             d="m 699.73,87.924 c 0,0 -11.356,6.654 -16.043,4.849 -4.687,-1.805 -11.374,-4.314 -13.316,-10.117 -1.942,-5.803 1.656,-9 -3.294,-12.285 -4.95,-3.285 -10.916,-3.6 -13.886,-1.764 a 106.543,106.543 0 0 0 -9.284,7.431 c 0,0 -7.507,2.152 -9.139,1.562 -1.632,-0.59 -3.782,0.47 -8.085,-6.945 -4.303,-7.415 -5.016,-45.814 -5.016,-45.814 l 48.552,2.183 35.919,35.957 z"
             fill="#9ed32b" />
          <path
             id="Path_25"
             data-name="Path 25"
             d="m 606.946,94.672 c -1.141,-1.394 -1.834,-5.168 -1.383,-7.07 0.451,-1.902 1.076,-4.62 2.6,-5.153 1.524,-0.533 2.4,1.159 3.239,-0.78 a 8.858,8.858 0 0 0 0.385,-5.818 c -0.506,-1.357 -2.028,-4.325 -2.028,-4.325 a 23.519,23.519 0 0 1 -0.47,-3.967 3.535,3.535 0 0 1 1.794,-3.088 c 1.941,-1.456 6.437,0.64 6.437,0.64 0,0 6.289,14.962 5.4,20.085 -0.7,4.034 -5.273,12.87 -9.324,13.462 -1.913,0.28 -5.421,-2.486 -6.65,-3.986 z"
             fill="#9ed32b" />
          <path
             id="Path_26"
             data-name="Path 26"
             d="m 655.135,120.376 c 1.977,1.545 4.03,7.175 1.95,9.845 -2.08,2.67 -4.994,6.484 -10.015,7.268 -5.021,0.784 -7.192,-1.559 -10.524,1.173 -3.332,2.732 -4.349,6.258 -3.215,8.14 a 59.8,59.8 0 0 0 4.933,5.992 c 0,0 0.817,4.6 0.126,5.532 -0.691,0.932 -0.094,2.277 -6.74,4.362 -6.646,2.085 -38.325,0.056 -38.325,0.056 l 7.965,-28.716 c 0,0 24.531,-17.272 34.142,-19.052 5.022,-0.929 15.678,2.256 19.703,5.4 z"
             fill="#9ed32b" />
        </g>
      </g>
      <path
         id="Path_28"
         data-name="Path 28"
         d="m 600.36887,55.007862 a 8.0088721,8.0088721 0 0 0 -6.4895,1.462362 c -3.44731,2.388323 -2.42633,4.290344 -1.20928,4.923487 1.21705,0.633143 3.95779,0.194348 5.00986,0.535537 1.05207,0.341189 1.61352,0.147705 3.21755,-0.535537 1.60402,-0.683242 -0.5675,-1.777638 0.77307,-3.082794 1.34057,-1.305156 2.61722,-1.776774 1.34057,-2.637088 a 4.1141348,4.1141348 0 0 0 -2.64227,-0.665967 z"
         fill="#5baed1"
         style="stroke-width:0.86377" />
    </g>
    <g
       id="g853"
       transform="matrix(2.5446807,0,0,2.5446807,605.80103,80.960513)">
      <g
         id="Icons">
        <path
           class="cls-1"
           d="m 17.607,14.79 4.8,4.8 a 1.9940411,1.9940411 0 0 1 -2.82,2.82 l -4.8,-4.8 z"
           id="path829"
           inkscape:connector-curvature="0"
           style="fill:#9e9da5" />
        <path
           class="cls-2"
           d="M 19,10 A 9,9 0 0 1 1,10 8.637,8.637 0 0 1 1.36,7.5 8.992,8.992 0 0 1 18.64,7.5 8.637,8.637 0 0 1 19,10 Z"
           id="path831"
           inkscape:connector-curvature="0"
           style="fill:#2eb1b7" />
        <ellipse
           class="cls-3"
           cx="10"
           cy="7.5"
           rx="8.6400003"
           ry="6.5"
           id="ellipse833"
           style="fill:#5dc6d1" />
        <path
           class="cls-4"
           d="M 5,11 A 1,1 0 0 1 4,10 6.006,6.006 0 0 1 10,4 1,1 0 0 1 10,6 4,4 0 0 0 6,10 1,1 0 0 1 5,11 Z"
           id="path835"
           inkscape:connector-curvature="0"
           style="fill:#eaeaea" />
      </g>
      <g
         data-name="Layer 4"
         id="Layer_4">
        <path
           class="cls-5"
           d="m 18.856,14.624 a 10.022,10.022 0 1 0 -4.234,4.234 l 4.254,4.255 a 2.9942454,2.9942454 0 1 0 4.239,-4.23 z M 2,10 a 8,8 0 1 1 8,8 8.009,8.009 0 0 1 -8,-8 z m 19.7,11.708 a 1,1 0 0 1 -1.4,0 L 16.333,17.74 a 10.092,10.092 0 0 0 1.4,-1.406 l 3.972,3.966 a 0.976,0.976 0 0 1 -0.009,1.407 z"
           id="path838"
           style="fill:#1a1a1a"
           inkscape:connector-curvature="0" />
      </g>
    </g>
  </g>
  <style
     type="text/css"
     id="style2108">
	.isometric_acht{fill:#F05A28;}
	.isometric_negen{fill:#BE1E2D;}
	.isometric_elf{fill:#72C0AB;}
	.isometric_twaalf{fill:#569080;}
	.st0{fill:#225B49;}
	.st1{fill:#F28103;}
	.st2{fill:#7BD6C4;}
	.st3{fill:#F29227;}
	.st4{fill:#FF7344;}
	.st5{fill:#F8F7C5;}
	.st6{fill:#F5DF89;}
	.st7{fill:#AD9A74;}
	.st8{fill:none;}
	.st9{fill:#BE1E2D;}
	.st10{fill:#F2D76C;}
	.st11{fill:#72C0AB;}
	.st12{fill:#569080;}
</style>
  <style
     type="text/css"
     id="style2">
	.st0{fill-rule:evenodd;clip-rule:evenodd;}
	.st1{fill-rule:evenodd;clip-rule:evenodd;fill:#7ACED7;}
</style>
</svg>
