<?xml version="1.0" encoding="UTF-8" standalone="no"?>
<!-- Uploaded to: SVG Repo, www.svgrepo.com, Transformed by: SVG Repo Mixer Tools -->

<svg
   fill="#000000"
   width="800px"
   height="800px"
   viewBox="0 0 56 56"
   version="1.1"
   id="svg4"
   sodipodi:docname="film2.svg"
   inkscape:version="1.1.2 (0a00cf5339, 2022-02-04, custom)"
   xmlns:inkscape="http://www.inkscape.org/namespaces/inkscape"
   xmlns:sodipodi="http://sodipodi.sourceforge.net/DTD/sodipodi-0.dtd"
   xmlns="http://www.w3.org/2000/svg"
   xmlns:svg="http://www.w3.org/2000/svg">
  <defs
     id="defs8" />
  <sodipodi:namedview
     id="namedview6"
     pagecolor="#505050"
     bordercolor="#ffffff"
     borderopacity="1"
     inkscape:pageshadow="0"
     inkscape:pageopacity="0"
     inkscape:pagecheckerboard="1"
     showgrid="false"
     inkscape:zoom="0.73450717"
     inkscape:cx="368.27415"
     inkscape:cy="423.41316"
     inkscape:window-width="1920"
     inkscape:window-height="1017"
     inkscape:window-x="-1928"
     inkscape:window-y="-8"
     inkscape:window-maximized="1"
     inkscape:current-layer="svg4" />
  <rect
     style="fill:#008000;fill-opacity:1;stroke:none;stroke-width:0.09198;stroke-linejoin:round;stroke-opacity:1;paint-order:markers fill stroke"
     id="rect1665"
     width="56"
     height="56"
     x="0"
     y="2.7755576e-17" />
  <path
     style="fill:#87aade;fill-opacity:1;stroke:none;stroke-width:0.0771696;stroke-linejoin:round;stroke-opacity:1;paint-order:markers fill stroke"
     d="M 7.4809513,9.8701332 H 48.538663 c 1.769582,0 2.654724,0.9241908 2.654724,2.6742238 v 30.911287 c 0,1.769666 -0.885142,2.674223 -2.654724,2.674223 H 7.4809513 c -1.7697493,0 -2.6743383,-0.904557 -2.6743383,-2.674223 V 12.544357 c 0,-1.750033 0.904589,-2.6742238 2.6743383,-2.6742238 z"
     id="path1393" />
  <path
     d="M 7.4809262,46.129904 H 48.538622 c 1.769582,0 2.654708,-0.904591 2.654708,-2.674255 V 12.544352 c 0,-1.750033 -0.885126,-2.674256 -2.654708,-2.674256 H 7.4809262 c -1.7697493,0 -2.6742562,0.924223 -2.6742562,2.674256 v 30.911297 c 0,1.769664 0.9045069,2.674255 2.6742562,2.674255 z M 8.8967087,16.378753 c -0.5898883,0 -1.0028355,-0.43258 -1.0028355,-0.963488 v -2.202328 c 0,-0.609604 0.3735989,-1.022551 1.0028355,-1.022551 h 2.3792703 c 0.589972,0 0.983203,0.412947 0.983203,1.022551 v 2.202328 c 0,0.530908 -0.393231,0.963488 -0.983203,0.963488 z m 35.6502883,0 c -0.589973,0 -1.002752,-0.43258 -1.002752,-0.963488 v -2.202328 c 0,-0.609604 0.393063,-1.022551 1.002752,-1.022551 h 2.379185 c 0.589973,0 1.002752,0.412947 1.002752,1.022551 v 2.202328 c 0,0.530908 -0.412779,0.963488 -1.002752,0.963488 z M 16.604859,26.505605 c -0.688217,0 -1.061817,-0.373683 -1.061817,-1.0619 V 13.861806 c 0,-0.688217 0.3736,-1.081448 1.061817,-1.081448 H 39.1984 c 0.688217,0 1.081449,0.393231 1.081449,1.081448 v 11.581899 c 0,0.688217 -0.393232,1.0619 -1.081449,1.0619 z M 8.8967087,23.241376 c -0.5898883,0 -1.0028355,-0.432579 -1.0028355,-0.963487 V 20.07556 c 0,-0.609604 0.3735989,-1.022551 1.0028355,-1.022551 h 2.3792703 c 0.589972,0 0.983203,0.412947 0.983203,1.022551 v 2.202329 c 0,0.530908 -0.393231,0.963487 -0.983203,0.963487 z m 35.6502883,0 c -0.589973,0 -1.002752,-0.432579 -1.002752,-0.963487 V 20.07556 c 0,-0.609604 0.393063,-1.022551 1.002752,-1.022551 h 2.379185 c 0.589973,0 1.002752,0.412947 1.002752,1.022551 v 2.202329 c 0,0.530908 -0.412779,0.963487 -1.002752,0.963487 z M 8.8967087,30.104 c -0.5898883,0 -1.0028355,-0.43258 -1.0028355,-0.963488 v -2.202328 c 0,-0.609604 0.3735989,-1.022551 1.0028355,-1.022551 h 2.3792703 c 0.589972,0 0.983203,0.412947 0.983203,1.022551 v 2.202328 c 0,0.530908 -0.393231,0.963488 -0.983203,0.963488 z m 35.6502883,0 c -0.589973,0 -1.002752,-0.43258 -1.002752,-0.963488 v -2.202328 c 0,-0.609604 0.393063,-1.022551 1.002752,-1.022551 h 2.379185 c 0.589973,0 1.002752,0.412947 1.002752,1.022551 v 2.202328 c 0,0.530908 -0.412779,0.963488 -1.002752,0.963488 z M 16.604859,43.239359 c -0.688217,0 -1.061817,-0.393315 -1.061817,-1.0619 V 30.654624 c 0,-0.668584 0.3736,-1.0619 1.061817,-1.0619 H 39.1984 c 0.688217,0 1.081449,0.393316 1.081449,1.0619 v 11.522835 c 0,0.668585 -0.393232,1.0619 -1.081449,1.0619 z M 8.8967087,36.966623 c -0.5898883,0 -1.0028355,-0.432579 -1.0028355,-0.963487 v -2.202329 c 0,-0.609604 0.3735989,-1.022551 1.0028355,-1.022551 h 2.3792703 c 0.589972,0 0.983203,0.412947 0.983203,1.022551 v 2.202329 c 0,0.530908 -0.393231,0.963487 -0.983203,0.963487 z m 35.6502883,0 c -0.589973,0 -1.002752,-0.432579 -1.002752,-0.963487 v -2.202329 c 0,-0.609604 0.393063,-1.022551 1.002752,-1.022551 h 2.379185 c 0.589973,0 1.002752,0.412947 1.002752,1.022551 v 2.202329 c 0,0.530908 -0.412779,0.963487 -1.002752,0.963487 z M 8.8967087,43.829247 c -0.5898883,0 -1.0028355,-0.432579 -1.0028355,-0.963571 v -2.202329 c 0,-0.60952 0.3735989,-1.022467 1.0028355,-1.022467 h 2.3792703 c 0.589972,0 0.983203,0.412947 0.983203,1.022467 v 2.202329 c 0,0.530992 -0.393231,0.963571 -0.983203,0.963571 z m 35.6502883,0 c -0.589973,0 -1.002752,-0.432579 -1.002752,-0.963571 v -2.202329 c 0,-0.60952 0.393063,-1.022467 1.002752,-1.022467 h 2.379185 c 0.589973,0 1.002752,0.412947 1.002752,1.022467 v 2.202329 c 0,0.530992 -0.412779,0.963571 -1.002752,0.963571 z"
     id="path2"
     style="fill:#000000;fill-opacity:1;stroke:none;stroke-width:0.838982;stroke-opacity:1" />
</svg>
