<?xml version="1.0" encoding="UTF-8" standalone="no"?>
<svg
   style="enable-background:new 0 0 512 512;"
   version="1.1"
   viewBox="0 0 512 512"
   xml:space="preserve"
   id="svg142"
   sodipodi:docname="office-building.svg"
   inkscape:version="1.1.2 (0a00cf5339, 2022-02-04, custom)"
   xmlns:inkscape="http://www.inkscape.org/namespaces/inkscape"
   xmlns:sodipodi="http://sodipodi.sourceforge.net/DTD/sodipodi-0.dtd"
   xmlns="http://www.w3.org/2000/svg"
   xmlns:svg="http://www.w3.org/2000/svg"><defs
     id="defs146" /><sodipodi:namedview
     id="namedview144"
     pagecolor="#505050"
     bordercolor="#ffffff"
     borderopacity="1"
     inkscape:pageshadow="0"
     inkscape:pageopacity="0"
     inkscape:pagecheckerboard="1"
     showgrid="false"
     inkscape:zoom="1.1476675"
     inkscape:cx="213.04081"
     inkscape:cy="268.37042"
     inkscape:window-width="1920"
     inkscape:window-height="1017"
     inkscape:window-x="-1928"
     inkscape:window-y="-8"
     inkscape:window-maximized="1"
     inkscape:current-layer="g137" /><style
     type="text/css"
     id="style2">
	.st0{fill:#16ADE1;}
	.st1{fill:#1B3954;}
</style><g
     id="Layer_1" /><g
     id="Layer_2"><g
       id="g139"><g
         id="g137"><path
           style="fill:#ffffff;stroke-width:1.846;paint-order:markers fill stroke"
           d="M 73.669922,178.92969 V 484.5 H 225.83008 V 178.92969 h -98.44922 z"
           id="path3725" /><path
           style="fill:#ffffff;stroke-width:1.846;paint-order:markers fill stroke"
           d="m 134.38086,27.5 v 137.42969 h 98.44922 c 0.96099,0 1.87585,0.19551 2.70898,0.54492 0.0112,0.005 0.0221,0.009 0.0332,0.0137 0.83117,0.35365 1.57994,0.8612 2.20898,1.49024 0.63313,0.63312 1.14609,1.38695 1.5,2.2246 0.35391,0.83766 0.54883,1.75907 0.54883,2.72657 V 484.5 h 198.49023 v -82.48047 c 0.002,-0.0148 0.007,-0.0262 0.01,-0.041 V 27.5 Z"
           id="path3723" /><path
           style="fill:#ffffff;stroke-width:1.846;paint-order:markers fill stroke"
           d="m 127.38086,13.5 h 317.93945 c 3.87,0 7,3.13 7,7 V 402.01953 405.44922 491.5 c 0.01,3.87 -3.13023,7 -6.99023,7 h -212.5 -166.160158 c -3.87,0 -7,-3.13 -7,-7 V 171.92969 c 0,-3.87 3.13,-7 7,-7 H 120.38086 V 20.5 c 0,-3.87 3.13,-7 7,-7 z"
           id="path3721" /><g
           id="g135-8"
           style="fill:#1a1a1a"
           transform="translate(-7.8e-5,-3.1e-4)"><path
             class="st1"
             d="M 232.83,498.5 H 66.67 c -3.87,0 -7,-3.13 -7,-7 V 171.93 c 0,-3.87 3.13,-7 7,-7 h 166.16 c 3.87,0 7,3.13 7,7 V 491.5 c 0,3.87 -3.13,7 -7,7 z M 73.67,484.5 H 225.83 V 178.93 H 73.67 Z"
             id="path133"
             style="fill:#1a1a1a" /></g><g
           id="g11"
           style="fill:#1a1a1a" /><g
           id="g15"
           style="fill:#1a1a1a" /><g
           id="g19"
           style="fill:#1a1a1a" /><g
           id="g53"
           style="fill:#1a1a1a"><g
             id="g23"
             style="fill:#1a1a1a"><path
               class="st0"
               d="M132.01,263.14h-29.62c-3.87,0-7-3.13-7-7v-29.62c0-3.87,3.13-7,7-7h29.62c3.87,0,7,3.13,7,7v29.62       C139.01,260.01,135.88,263.14,132.01,263.14z M109.39,249.14h15.62v-15.62h-15.62V249.14z"
               id="path21"
               style="fill:#1a1a1a" /></g><g
             id="g27"
             style="fill:#1a1a1a"><path
               class="st0"
               d="M197.12,263.14H167.5c-3.87,0-7-3.13-7-7v-29.62c0-3.87,3.13-7,7-7h29.62c3.87,0,7,3.13,7,7v29.62       C204.12,260.01,200.98,263.14,197.12,263.14z M174.5,249.14h15.62v-15.62H174.5V249.14z"
               id="path25"
               style="fill:#1a1a1a" /></g><g
             id="g31"
             style="fill:#1a1a1a"><path
               class="st0"
               d="M132.01,323.4h-29.62c-3.87,0-7-3.13-7-7v-29.62c0-3.87,3.13-7,7-7h29.62c3.87,0,7,3.13,7,7v29.62       C139.01,320.26,135.88,323.4,132.01,323.4z M109.39,309.4h15.62v-15.62h-15.62V309.4z"
               id="path29"
               style="fill:#1a1a1a" /></g><g
             id="g35"
             style="fill:#1a1a1a"><path
               class="st0"
               d="M197.12,323.4H167.5c-3.87,0-7-3.13-7-7v-29.62c0-3.87,3.13-7,7-7h29.62c3.87,0,7,3.13,7,7v29.62       C204.12,320.26,200.98,323.4,197.12,323.4z M174.5,309.4h15.62v-15.62H174.5V309.4z"
               id="path33"
               style="fill:#1a1a1a" /></g><g
             id="g39"
             style="fill:#1a1a1a"><path
               class="st0"
               d="M132.01,383.65h-29.62c-3.87,0-7-3.13-7-7v-29.62c0-3.87,3.13-7,7-7h29.62c3.87,0,7,3.13,7,7v29.62       C139.01,380.52,135.88,383.65,132.01,383.65z M109.39,369.65h15.62v-15.62h-15.62V369.65z"
               id="path37"
               style="fill:#1a1a1a" /></g><g
             id="g43"
             style="fill:#1a1a1a"><path
               class="st0"
               d="M197.12,383.65H167.5c-3.87,0-7-3.13-7-7v-29.62c0-3.87,3.13-7,7-7h29.62c3.87,0,7,3.13,7,7v29.62       C204.12,380.52,200.98,383.65,197.12,383.65z M174.5,369.65h15.62v-15.62H174.5V369.65z"
               id="path41"
               style="fill:#1a1a1a" /></g><g
             id="g47"
             style="fill:#1a1a1a"><path
               class="st0"
               d="M132.01,443.91h-29.62c-3.87,0-7-3.13-7-7v-29.62c0-3.87,3.13-7,7-7h29.62c3.87,0,7,3.13,7,7v29.62       C139.01,440.77,135.88,443.91,132.01,443.91z M109.39,429.91h15.62v-15.62h-15.62V429.91z"
               id="path45"
               style="fill:#1a1a1a" /></g><g
             id="g51"
             style="fill:#1a1a1a"><path
               class="st0"
               d="M197.12,443.91H167.5c-3.87,0-7-3.13-7-7v-29.62c0-3.87,3.13-7,7-7h29.62c3.87,0,7,3.13,7,7v29.62       C204.12,440.77,200.98,443.91,197.12,443.91z M174.5,429.91h15.62v-15.62H174.5V429.91z"
               id="path49"
               style="fill:#1a1a1a" /></g></g><g
           id="g67"
           style="fill:#1a1a1a"><g
             id="g57"
             style="fill:#1a1a1a"><path
               class="st1"
               d="M308.11,328.1h-28.6c-3.87,0-7-3.13-7-7v-28.6c0-3.87,3.13-7,7-7h28.6c3.87,0,7,3.13,7,7v28.6       C315.11,324.97,311.97,328.1,308.11,328.1z M286.51,314.1h14.6v-14.6h-14.6V314.1z"
               id="path55"
               style="fill:#1a1a1a" /></g><g
             id="g61"
             style="fill:#1a1a1a"><path
               class="st1"
               d="M308.11,393.8h-28.6c-3.87,0-7-3.13-7-7v-28.6c0-3.87,3.13-7,7-7h28.6c3.87,0,7,3.13,7,7v28.6       C315.11,390.67,311.97,393.8,308.11,393.8z M286.51,379.8h14.6v-14.6h-14.6V379.8z"
               id="path59"
               style="fill:#1a1a1a" /></g><g
             id="g65"
             style="fill:#1a1a1a"><path
               class="st1"
               d="M308.11,459.5h-28.6c-3.87,0-7-3.13-7-7v-28.6c0-3.87,3.13-7,7-7h28.6c3.87,0,7,3.13,7,7v28.6       C315.11,456.36,311.97,459.5,308.11,459.5z M286.51,445.5h14.6v-14.6h-14.6V445.5z"
               id="path63"
               style="fill:#1a1a1a" /></g></g><g
           id="g71"
           style="fill:#1a1a1a"><path
             class="st0"
             d="M197.85,85.19h-29.53c-3.87,0-7-3.13-7-7V48.66c0-3.87,3.13-7,7-7h29.53c3.87,0,7,3.13,7,7v29.53      C204.85,82.06,201.72,85.19,197.85,85.19z M175.32,71.19h15.53V55.66h-15.53V71.19z"
             id="path69"
             style="fill:#1a1a1a" /></g><g
           id="g75"
           style="fill:#1a1a1a"><path
             class="st0"
             d="M268.12,85.19h-29.53c-3.87,0-7-3.13-7-7V48.66c0-3.87,3.13-7,7-7h29.53c3.87,0,7,3.13,7,7v29.53      C275.12,82.06,271.99,85.19,268.12,85.19z M245.59,71.19h15.53V55.66h-15.53V71.19z"
             id="path73"
             style="fill:#1a1a1a" /></g><g
           id="g79"
           style="fill:#1a1a1a"><path
             class="st0"
             d="M338.38,85.19h-29.53c-3.87,0-7-3.13-7-7V48.66c0-3.87,3.13-7,7-7h29.53c3.87,0,7,3.13,7,7v29.53      C345.38,82.06,342.25,85.19,338.38,85.19z M315.85,71.19h15.53V55.66h-15.53V71.19z"
             id="path77"
             style="fill:#1a1a1a" /></g><g
           id="g83"
           style="fill:#1a1a1a"><path
             class="st0"
             d="M413.28,85.19h-29.53c-3.87,0-7-3.13-7-7V48.66c0-3.87,3.13-7,7-7h29.53c3.87,0,7,3.13,7,7v29.53      C420.28,82.06,417.14,85.19,413.28,85.19z M390.75,71.19h15.53V55.66h-15.53V71.19z"
             id="path81"
             style="fill:#1a1a1a" /></g><g
           id="g87"
           style="fill:#1a1a1a"><path
             class="st1"
             d="M197.85,146.83h-29.53c-3.87,0-7-3.13-7-7V110.3c0-3.87,3.13-7,7-7h29.53c3.87,0,7,3.13,7,7v29.53      C204.85,143.7,201.72,146.83,197.85,146.83z M175.32,132.83h15.53V117.3h-15.53V132.83z"
             id="path85"
             style="fill:#1a1a1a" /></g><g
           id="g91"
           style="fill:#1a1a1a"><path
             class="st1"
             d="M268.12,146.83h-29.53c-3.87,0-7-3.13-7-7V110.3c0-3.87,3.13-7,7-7h29.53c3.87,0,7,3.13,7,7v29.53      C275.12,143.7,271.99,146.83,268.12,146.83z M245.59,132.83h15.53V117.3h-15.53V132.83z"
             id="path89"
             style="fill:#1a1a1a" /><path
             class="st1"
             d="m 268.11,208.47 h -29.53 c -3.87,0 -7,-3.13 -7,-7 v -29.53 c 0,-3.87 3.13,-7 7,-7 h 29.53 c 3.87,0 7,3.13 7,7 v 29.53 c 0,3.87 -3.13,7 -7,7 z m -22.53,-14 h 15.53 v -15.53 h -15.53 z"
             id="path89-3"
             style="fill:#1a1a1a" /></g><g
           id="g95"
           style="fill:#1a1a1a"><path
             class="st1"
             d="M338.38,146.83h-29.53c-3.87,0-7-3.13-7-7V110.3c0-3.87,3.13-7,7-7h29.53c3.87,0,7,3.13,7,7v29.53      C345.38,143.7,342.25,146.83,338.38,146.83z M315.85,132.83h15.53V117.3h-15.53V132.83z"
             id="path93"
             style="fill:#1a1a1a" /></g><g
           id="g99"
           style="fill:#1a1a1a"><path
             class="st1"
             d="M413.28,146.83h-29.53c-3.87,0-7-3.13-7-7V110.3c0-3.87,3.13-7,7-7h29.53c3.87,0,7,3.13,7,7v29.53      C420.28,143.7,417.14,146.83,413.28,146.83z M390.75,132.83h15.53V117.3h-15.53V132.83z"
             id="path97"
             style="fill:#1a1a1a" /></g><g
           id="g107"
           style="fill:#1a1a1a"><path
             class="st1"
             d="M338.38,208.47h-29.53c-3.87,0-7-3.13-7-7v-29.53c0-3.87,3.13-7,7-7h29.53c3.87,0,7,3.13,7,7v29.53      C345.38,205.33,342.25,208.47,338.38,208.47z M315.85,194.47h15.53v-15.53h-15.53V194.47z"
             id="path105"
             style="fill:#1a1a1a" /></g><g
           id="g111"
           style="fill:#1a1a1a"><path
             class="st1"
             d="M413.28,208.47h-29.53c-3.87,0-7-3.13-7-7v-29.53c0-3.87,3.13-7,7-7h29.53c3.87,0,7,3.13,7,7v29.53      C420.28,205.33,417.14,208.47,413.28,208.47z M390.75,194.47h15.53v-15.53h-15.53V194.47z"
             id="path109"
             style="fill:#1a1a1a" /></g><g
           id="g115"
           style="fill:#1a1a1a"><path
             class="st1"
             d="M413.28,270.1h-29.53c-3.87,0-7-3.13-7-7v-29.53c0-3.87,3.13-7,7-7h29.53c3.87,0,7,3.13,7,7v29.53      C420.28,266.97,417.14,270.1,413.28,270.1z M390.75,256.1h15.53v-15.53h-15.53V256.1z"
             id="path113"
             style="fill:#1a1a1a" /></g><g
           id="g119"
           style="fill:#1a1a1a"><path
             class="st1"
             d="M413.28,331.74h-29.53c-3.87,0-7-3.13-7-7v-29.53c0-3.87,3.13-7,7-7h29.53c3.87,0,7,3.13,7,7v29.53      C420.28,328.61,417.14,331.74,413.28,331.74z M390.75,317.74h15.53v-15.53h-15.53V317.74z"
             id="path117"
             style="fill:#1a1a1a" /></g><g
           id="g123"
           style="fill:#1a1a1a"><path
             class="st1"
             d="M413.28,393.38h-29.53c-3.87,0-7-3.13-7-7v-29.53c0-3.87,3.13-7,7-7h29.53c3.87,0,7,3.13,7,7v29.53      C420.28,390.24,417.14,393.38,413.28,393.38z M390.75,379.38h15.53v-15.53h-15.53V379.38z"
             id="path121"
             style="fill:#1a1a1a" /></g><g
           id="g127"
           style="fill:#1a1a1a"><path
             class="st1"
             d="M413.28,455.01h-29.53c-3.87,0-7-3.13-7-7v-29.53c0-3.87,3.13-7,7-7h29.53c3.87,0,7,3.13,7,7v29.53      C420.28,451.88,417.14,455.01,413.28,455.01z M390.75,441.01h15.53v-15.53h-15.53V441.01z"
             id="path125"
             style="fill:#1a1a1a" /></g><g
           id="g131"
           style="fill:#1a1a1a"><path
             class="st0"
             d="M 354.79,498.5 H 232.83 c -3.87,0 -7,-3.13 -7,-7 v -238 c 0,-3.87 3.13,-7 7,-7 h 128.95 c 0,14 0,0 0,14 H 239.83 v 224 h 107.95 v -224 c 14,0 0,0 14,0 v 231 c 0.01,3.87 -3.13,7 -6.99,7 z"
             id="path129"
             sodipodi:nodetypes="sssssccccccccs"
             style="fill:#1a1a1a" /></g><g
           id="g135"
           style="fill:#1a1a1a" /></g><g
         id="g19-3"
         style="fill:#1a1a1a"
         transform="translate(8.6e-4)"><path
           class="st1"
           d="M 438.33,405.55887 V 27.5 H 134.38 v 137.43 h -14 V 20.5 c 0,-3.87 3.13,-7 7,-7 h 317.94 c 3.87,0 7,3.13 7,7 v 384.94995 c -14.0006,0 0,0 -13.99,0.10892 z"
           id="path17"
           sodipodi:nodetypes="cccccsssscc"
           style="fill:#1a1a1a" /></g><g
         id="g11-1"
         style="fill:#1a1a1a"
         transform="translate(8e-5)"><path
           class="st1"
           d="m 445.33,498.5 h -212.5 c -3.87,0 -7,-3.13 -7,-7 V 178.93 h -98.45 l 7,-14 h 98.45 c 3.87,0 7,3.13 7,7 V 484.5 h 198.49 v -82.48 c 1.61199,-10.30464 13.77154,-7.53274 14,0 v 89.48 c 0.01,3.87 -3.13,7 -6.99,7 z"
           id="path9"
           sodipodi:nodetypes="ssscccsscccccs"
           style="fill:#1a1a1a" /></g></g></g></svg>
