<?xml version="1.0" encoding="UTF-8" standalone="no"?>
<!-- Uploaded to: SVG Repo, www.svgrepo.com, Transformed by: SVG Repo Mixer Tools -->

<svg
   height="800px"
   width="800px"
   version="1.1"
   id="Layer_1"
   viewBox="0 0 512 512"
   xml:space="preserve"
   sodipodi:docname="hand_blue_card.svg"
   inkscape:version="1.1.2 (0a00cf5339, 2022-02-04, custom)"
   xmlns:inkscape="http://www.inkscape.org/namespaces/inkscape"
   xmlns:sodipodi="http://sodipodi.sourceforge.net/DTD/sodipodi-0.dtd"
   xmlns="http://www.w3.org/2000/svg"
   xmlns:svg="http://www.w3.org/2000/svg"><defs
   id="defs17"><inkscape:path-effect
     effect="fillet_chamfer"
     id="path-effect4051"
     is_visible="true"
     lpeversion="1"
     satellites_param="F,0,0,1,0,40,0,1 @ F,0,0,1,0,40,0,1 @ F,0,0,1,0,40,0,1 @ F,0,0,1,0,40,0,1"
     unit="px"
     method="auto"
     mode="F"
     radius="40"
     chamfer_steps="1"
     flexible="false"
     use_knot_distance="true"
     apply_no_radius="true"
     apply_with_radius="true"
     only_selected="false"
     hide_knots="false" /></defs><sodipodi:namedview
   id="namedview15"
   pagecolor="#505050"
   bordercolor="#ffffff"
   borderopacity="1"
   inkscape:pageshadow="0"
   inkscape:pageopacity="0"
   inkscape:pagecheckerboard="1"
   showgrid="false"
   inkscape:zoom="0.091813396"
   inkscape:cx="-1955.0524"
   inkscape:cy="1089.1657"
   inkscape:window-width="1920"
   inkscape:window-height="1017"
   inkscape:window-x="-8"
   inkscape:window-y="-8"
   inkscape:window-maximized="1"
   inkscape:current-layer="Layer_1" />






<g
   id="g3375"
   transform="matrix(0.68374843,0,0,0.68374843,92.320329,111.55652)"><g
     id="g1202"
     transform="rotate(-90.075353,416.96618,161.04974)"><path
       style="fill:#2197f3;fill-opacity:1;stroke:#2197f3;stroke-width:1.8711;stroke-linejoin:round;stroke-miterlimit:4;stroke-dasharray:none;stroke-opacity:1;paint-order:markers fill stroke"
       id="rect3815"
       width="300.78152"
       height="528.51605"
       x="-42.43824"
       y="-697.96619"
       transform="rotate(90.075353)"
       inkscape:path-effect="#path-effect4051"
       d="M -2.4382401,-697.96619 H 218.34328 a 40,40 45 0 1 40,40 v 448.51606 a 40,40 135 0 1 -40,40 H -2.4382401 a 40,40 45 0 1 -39.9999999,-40 v -448.51606 a 40,40 135 0 1 39.9999999,-40 z"
       sodipodi:type="rect" /><path
       id="SVGCleanerId_0"
       style="fill:#ff9811;stroke-width:1.0078"
       d="m 312.28284,-193.88215 c -7.05308,-2.39849 -14.80815,-3.72408 -22.94802,-3.72406 l -186.68303,-6e-4 c -27.133101,0 -49.128161,17.68446 -49.128159,39.49894 l 0.615403,253.534273 c 0,12.271767 12.371737,22.218767 27.63488,22.218767 10.079519,0 18.895086,-4.34082 23.722416,-10.82282 l 4.2e-4,22.17748 c 10e-6,13.63359 13.74733,24.68713 30.70425,24.68713 15.30024,0 27.98636,-9.00094 30.31629,-20.77569 l -1e-5,19.78859 c -0.002,13.6327 13.74487,24.68669 30.70292,24.68669 16.95692,0 30.7052,-11.05412 30.70522,-24.68772 l -2.7e-4,-17.96749 c 3.2156,10.86928 15.36121,18.95526 29.86457,18.95526 16.95694,0 30.70477,-11.0528 30.70477,-24.6864 l -4.4e-4,-130.8399073 0.88373,-39.5964247 c 21.17806,-0.97711 41.23412,0.246413 58.91118,2.446726 l -6.9e-4,-89.247494 -4e-4,-0.0164 4.9e-4,-21.9549 c 0,-19.63371 -14.84629,-36.47846 -36.00552,-43.67391 z M 288.49405,-1.8397073 c 0.38837,0.92486404 0.84351,1.82448704 1.35979,2.69663404 -0.4756,-0.922865 -0.95589,-1.852978 -1.35979,-2.69663404 z" /><path
       style="fill:#e88a0f;stroke-width:1.0078"
       d="m 102.65149,-197.60608 c -27.133104,0 -49.127537,17.68472 -49.127537,39.49921 L 54.13875,95.427243 c 0,12.271777 12.371234,22.218417 27.634377,22.218417 10.079519,0 18.895723,-4.3403 23.723063,-10.82229 v 22.17683 c 0,13.63361 13.74807,24.68724 30.70499,24.68724 15.30024,0 27.98618,-9.00141 30.31611,-20.77617 v 19.78937 c 0,13.6336 13.74807,24.68722 30.705,24.68722 0.47655,0 0.9486,-0.0112 1.41954,-0.0298 v -374.96413 z"
       id="path6" /><path
       style="fill:#4d4d4d;stroke-width:1.12394"
       d="M 358.54068,-171.25412 V -288.2397 c 0,-10.17393 -8.2475,-18.42255 -18.42143,-18.42255 H 57.164404 c -10.173929,0 -18.422546,8.24862 -18.422546,18.42255 v 116.98446 c 0,10.17393 8.248617,18.42255 18.422546,18.42255 H 340.11925 c 10.17393,0 18.42143,-8.2475 18.42143,-18.42143 z"
       id="path8" /><path
       style="fill:#333333;stroke-width:1.12394"
       d="m 358.54068,-171.25412 v -58.49335 H 38.741858 v 58.49223 c 0,10.17393 8.248617,18.42255 18.422546,18.42255 H 340.11925 c 10.17393,0 18.42143,-8.2475 18.42143,-18.42143 z"
       id="path10" /><circle
       style="fill:#ffffff;stroke-width:1.12394"
       cx="-229.7486"
       cy="-106.41672"
       r="28.489702"
       id="circle12"
       transform="rotate(90)" /></g></g></svg>
