<?xml version="1.0" encoding="UTF-8" standalone="no"?>
<svg
   width="64px"
   height="64px"
   viewBox="0 0 32 32"
   enable-background="new 0 0 32 32"
   version="1.1"
   xml:space="preserve"
   fill="#000000"
   stroke="#000000"
   stroke-width="0"
   id="svg60"
   sodipodi:docname="sort_az_descending.svg"
   inkscape:version="1.1.2 (0a00cf5339, 2022-02-04, custom)"
   inkscape:export-filename="C:\Users\bened\Desktop\helium\lpclientpc\src\com\lp\client\res\svgs\arrow_up_blue.png"
   inkscape:export-xdpi="24"
   inkscape:export-ydpi="24"
   xmlns:inkscape="http://www.inkscape.org/namespaces/inkscape"
   xmlns:sodipodi="http://sodipodi.sourceforge.net/DTD/sodipodi-0.dtd"
   xmlns="http://www.w3.org/2000/svg"
   xmlns:svg="http://www.w3.org/2000/svg"><defs
   id="defs64" /><sodipodi:namedview
   id="namedview62"
   pagecolor="#505050"
   bordercolor="#ffffff"
   borderopacity="1"
   inkscape:pageshadow="0"
   inkscape:pageopacity="0"
   inkscape:pagecheckerboard="1"
   showgrid="false"
   inkscape:zoom="6.4921875"
   inkscape:cx="0.53910951"
   inkscape:cy="26.33935"
   inkscape:window-width="1920"
   inkscape:window-height="1017"
   inkscape:window-x="-1928"
   inkscape:window-y="-8"
   inkscape:window-maximized="1"
   inkscape:current-layer="Upload" />

<g
   id="SVGRepo_bgCarrier"
   stroke-width="0" />

<g
   id="SVGRepo_iconCarrier">

<g
   id="Home" />

<g
   id="Print" />

<g
   id="Mail" />

<g
   id="Camera" />

<g
   id="Video" />

<g
   id="Film" />

<g
   id="Message" />

<g
   id="Telephone" />

<g
   id="User" />

<g
   id="File" />

<g
   id="Folder" />

<g
   id="Map" />

<g
   id="Download" />

<g
   id="Upload">

<line
   fill="none"
   x1="16"
   x2="16"
   y1="29"
   y2="28"
   id="line16" />

<path
   d="m 3.8426133,20.310359 6.8783637,6.878364 c 0.15457,0.15457 0.30914,0.231855 0.540995,0.231855 0,0 0,0 0,0 0,0 0,0 0,0 v 0 c 0.231855,0 0.386425,-0.07728 0.540995,-0.231855 l 6.955649,-6.955649 c 0.231854,-0.231855 0.309139,-0.540995 0.154569,-0.850135 -0.07728,-0.30914 -0.386424,-0.46371 -0.695564,-0.46371 h -3.0914 V 7.3264809 c 0,-0.3864249 -0.386425,-0.7728499 -0.77285,-0.7728499 h -3.091399 v 0 H 8.1705724 v 0 c -0.386425,0 -0.7728497,0.386425 -0.7728497,0.7728499 V 18.919229 H 4.3063233 v 0 c -0.386425,0 -0.7728499,0.30914 -0.7728499,0.77285 0,0.231855 0.15457,0.46371 0.3091399,0.61828 z"
   fill="#2197f3"
   id="path18"
   inkscape:export-filename="C:\Users\bened\Desktop\helium\lpclientpc\src\com\lp\client\res\svgs\arrow_down_blue.png"
   inkscape:export-xdpi="16"
   inkscape:export-ydpi="16"
   style="stroke-width:0" />



<text
   xml:space="preserve"
   style="font-style:normal;font-weight:normal;font-size:17.4338px;line-height:1.25;font-family:sans-serif;fill:#44aa00;fill-opacity:1;stroke:none;stroke-width:0"
   x="17.559566"
   y="15.180458"
   id="text2218"><tspan
     sodipodi:role="line"
     id="tspan2216"
     style="fill:#44aa00;fill-opacity:1;stroke-width:0"
     x="17.559566"
     y="15.180458">A</tspan></text><text
   xml:space="preserve"
   style="font-style:normal;font-weight:normal;font-size:17.5088px;line-height:1.25;font-family:sans-serif;fill:#44aa00;fill-opacity:1;stroke:none;stroke-width:0"
   x="18.268417"
   y="29.420464"
   id="text3476"
   transform="scale(1.0001026,0.99989742)"><tspan
     sodipodi:role="line"
     id="tspan3474"
     style="fill:#44aa00;fill-opacity:1;stroke-width:0"
     x="18.268417"
     y="29.420464">Z</tspan></text></g>

<g
   id="Video_Recorder" />

<g
   id="Schedule" />

<g
   id="Cart" />

<g
   id="Setting" />

<g
   id="Search" />

<g
   id="Pencils" />

<g
   id="Group" />

<g
   id="Record" />

<g
   id="Headphone" />

<g
   id="Music_Player" />

<g
   id="Sound_On" />

<g
   id="Sound_Off" />

<g
   id="Lock" />

<g
   id="Lock_open" />

<g
   id="Love" />

<g
   id="Favorite" />

<g
   id="Film_1_" />

<g
   id="Music" />

<g
   id="Puzzle" />

<g
   id="Turn_Off" />

<g
   id="Book" />

<g
   id="Save" />

<g
   id="Reload" />

<g
   id="Trash" />

<g
   id="Tag" />

<g
   id="Link" />

<g
   id="Like" />

<g
   id="Bad" />

<g
   id="Gallery" />

<g
   id="Add" />

<g
   id="Close" />

<g
   id="Forward" />

<g
   id="Back" />

<g
   id="Buy" />

<g
   id="Mac" />

<g
   id="Laptop" />

</g>

</svg>
