<!DOCTYPE svg PUBLIC "-//W3C//DTD SVG 1.1//EN" "http://www.w3.org/Graphics/SVG/1.1/DTD/svg11.dtd">
<svg width="64px" height="64px" viewBox="0 0 24.00 24.00" xmlns:rdf="http://www.w3.org/1999/02/22-rdf-syntax-ns#" xmlns="http://www.w3.org/2000/svg" version="1.1" xmlns:cc="http://creativecommons.org/ns#" xmlns:dc="http://purl.org/dc/elements/1.1/" fill="#000000" stroke="#000000" stroke-width="0">
<g id="SVGRepo_bgCarrier" stroke-width="0"/>
<g id="SVGRepo_iconCarrier"> <g transform="translate(0 -1028.4)"> <g> <path d="m5 1028.4c-1.1046 0-2 0.9-2 2v1 7 1 3 1 5 1c0 1.1 0.8954 2 2 2h14c1.105 0 2-0.9 2-2v-1-5-4-4-1-3-1c0-1.1-0.895-2-2-2h-4-10z" fill="#ac830c"/> <path d="m6 1028.4c-1.1046 0-2 0.9-2 2v8 4 6c0 1.1 0.8954 2 2 2h8 4c1.105 0 2-0.9 2-2v-6-4-4-4c0-1.1-0.895-2-2-2h-4-8z" fill="#ecf0f1"/> <path d="m15 1042.4v1 1 1 4h4c1.105 0 2-0.9 2-2v-2-2-1h-6z" fill="#2ecc71"/> <path d="m15 1037.4v1 1 1 4h4c1.105 0 2-0.9 2-2v-2-2-1h-6z" fill="#e74c3c"/> <path d="m15 1032.4v1 1 1 4h4c1.105 0 2-0.9 2-2v-2-2-1h-6z" fill="#d17abf"/> <path d="m15 0v2h4v2 2c1.105 0 2-0.8954 2-2v-2c0-1.1046-0.895-2-2-2h-4z" transform="translate(0 1028.4)" fill="#2980b9"/> <path d="m5 1028.4c-1.1046 0-2 0.9-2 2v8 4 5h1v1 3c0-1.1 0.8954-2 2-2h8 1 1.281 0.719 0.281c0.74 0 1.373-0.4 1.719-1v-1-5-4-4-4c0-1.1-0.895-2-2-2h-4-8z" fill="#edd95d"/> </g> <g fill="#ac830c" transform="translate(0,-2)"> <path d="m10.439 1041c0 0.5 0.108 0.9 0.323 1.2 0.22 0.3 0.516 0.5 0.889 0.5 0.368 0 0.663-0.2 0.882-0.5 0.22-0.3 0.329-0.7 0.329-1.2s-0.112-0.9-0.335-1.2c-0.22-0.3-0.516-0.4-0.889-0.4-0.364 0-0.656 0.1-0.876 0.4-0.215 0.3-0.323 0.7-0.323 1.2m2.548 1.9c-0.125 0.3-0.326 0.5-0.603 0.7-0.273 0.1-0.594 0.2-0.963 0.2-0.712 0-1.292-0.2-1.7395-0.8-0.4431-0.5-0.6647-1.1-0.6647-2 0-0.8 0.2236-1.5 0.6709-2s1.0253-0.8 1.7333-0.8c0.369 0 0.69 0.1 0.963 0.3 0.277 0.1 0.478 0.4 0.603 0.7v-0.8h1.298v4.3c0.514-0.1 0.917-0.4 1.211-0.8s0.441-0.9 0.441-1.6c0-0.4-0.06-0.8-0.18-1.1-0.12-0.4-0.302-0.7-0.546-1-0.394-0.5-0.887-0.9-1.479-1.2-0.588-0.3-1.226-0.4-1.913-0.4-0.481 0-0.941 0-1.38 0.2-0.439 0.1-0.8445 0.3-1.2172 0.5-0.613 0.4-1.0913 1-1.4351 1.6-0.3396 0.6-0.5094 1.3-0.5094 2.1 0 0.6 0.1098 1.2 0.3293 1.7 0.2236 0.6 0.5446 1 0.9629 1.5 0.4142 0.4 0.8884 0.7 1.4226 0.9 0.5389 0.2 1.1119 0.3 1.7209 0.3 0.522 0 1.044-0.1 1.566-0.3 0.521-0.2 0.967-0.4 1.335-0.8l0.665 1c-0.518 0.4-1.083 0.7-1.696 1-0.609 0.2-1.228 0.3-1.858 0.3-0.766 0-1.489-0.2-2.1677-0.4-0.6793-0.3-1.2839-0.7-1.8141-1.2-0.5301-0.5-0.9339-1.1-1.2114-1.8s-0.4162-1.4-0.4162-2.2 0.1408-1.5 0.4224-2.2 0.6834-1.3 1.2052-1.8c0.5219-0.5 1.1286-0.9 1.8203-1.2 0.6955-0.2 1.4165-0.4 2.1615-0.4 0.928 0 1.771 0.2 2.529 0.6 0.758 0.3 1.391 0.8 1.901 1.5 0.311 0.4 0.545 0.8 0.702 1.3 0.161 0.5 0.242 1 0.242 1.5 0 1.1-0.337 2-1.012 2.6-0.676 0.6-1.628 0.9-2.858 0.9h-0.242v-0.9"/> </g> <path d="m2 1031.4v1h2v-1h-2zm0 3v1h2v-1h-2zm0 3v1h2v-1h-2zm0 3v1h2v-1h-2zm0 3v1h2v-1h-2zm0 3v1h2v-1h-2z" fill="#95a5a6"/> <path d="m5 1028.4c-1.1046 0-2 0.9-2 2v1 7 1 3 1 5 1c0 1.1 0.8954 2 2 2h1c-1.1046 0-2-0.9-2-2v-1-5-1-3-1-7-1c0-1.1 0.8954-2 2-2h-1z" fill="#ac830c"/> <g fill="#bdc3c7"> <path d="m2 1030.4v1h1v-1h-1zm0 3v1h1v-1h-1zm0 3v1h1v-1h-1zm0 3v1h1v-1h-1zm0 3v1h1v-1h-1zm0 3v1h1v-1h-1z"/> <path d="m2 1030.4c-0.5523 0-1 0.4-1 1 0 0.5 0.4477 1 1 1v-2z"/> <path d="m2 1033.4c-0.5523 0-1 0.4-1 1 0 0.5 0.4477 1 1 1v-2z"/> <path d="m2 1036.4c-0.5523 0-1 0.4-1 1 0 0.5 0.4477 1 1 1v-2z"/> <path d="m2 1039.4c-0.5523 0-1 0.4-1 1 0 0.5 0.4477 1 1 1v-2z"/> <path d="m2 1042.4c-0.5523 0-1 0.4-1 1 0 0.5 0.4477 1 1 1v-2z"/> <path d="m2 1045.4c-0.5523 0-1 0.4-1 1 0 0.5 0.4477 1 1 1v-2z"/> </g> <path d="m3 1030.4v1h1v-1h-1zm0 3v1h1v-1h-1zm0 3v1h1v-1h-1zm0 3v1h1v-1h-1zm0 3v1h1v-1h-1zm0 3v1h1v-1h-1z" fill="#95a5a6"/> </g> </g>
</svg>