<?xml version="1.0" encoding="UTF-8" standalone="no"?>
<svg
   id="Layer_1"
   version="1.1"
   viewBox="0 0 87.643417 87.645241"
   xml:space="preserve"
   sodipodi:docname="status_offen.svg"
   inkscape:version="1.1.2 (0a00cf5339, 2022-02-04, custom)"
   inkscape:export-filename="C:\Users\bened\Desktop\helium\lpclientpc\src\com\lp\client\res\svgs\branch.png"
   inkscape:export-xdpi="12"
   inkscape:export-ydpi="12"
   width="87.643417"
   height="87.645241"
   xmlns:inkscape="http://www.inkscape.org/namespaces/inkscape"
   xmlns:sodipodi="http://sodipodi.sourceforge.net/DTD/sodipodi-0.dtd"
   xmlns="http://www.w3.org/2000/svg"
   xmlns:svg="http://www.w3.org/2000/svg"><defs
     id="defs10"><style
       id="style825">.cls-1{fill:#9e9da5;}.cls-2{fill:#2eb1b7;}.cls-3{fill:#5dc6d1;}.cls-4{fill:#eaeaea;}.cls-5{fill:#6c2e7c;}</style></defs><sodipodi:namedview
     id="namedview8"
     pagecolor="#505050"
     bordercolor="#ffffff"
     borderopacity="1"
     inkscape:pageshadow="0"
     inkscape:pageopacity="0"
     inkscape:pagecheckerboard="1"
     showgrid="false"
     inkscape:zoom="6.4921876"
     inkscape:cx="18.868832"
     inkscape:cy="30.190132"
     inkscape:window-width="1920"
     inkscape:window-height="1017"
     inkscape:window-x="-1928"
     inkscape:window-y="-8"
     inkscape:window-maximized="1"
     inkscape:current-layer="g1425"
     fit-margin-top="0"
     fit-margin-left="0"
     fit-margin-right="0"
     fit-margin-bottom="0" /><style
     type="text/css"
     id="style2">
	.st0{fill-rule:evenodd;clip-rule:evenodd;}
	.st1{fill-rule:evenodd;clip-rule:evenodd;fill:#7ACED7;}
</style><g
     id="XMLID_1_"
     transform="rotate(180,137.50085,130.82535)"><g
       id="g853"
       transform="matrix(-3.0118947,0,0,-3.0118947,267.23852,253.89338)"><g
         id="g940"><g
           id="Icons" /><g
           id="g1425"
           transform="translate(0.61369191,-0.35798695)"><g
             id="g1411"
             transform="translate(-0.15342298,0.15342298)" /><g
             id="g1629"
             transform="translate(3.6821522,0.92053724)"><path
               class="cls-1"
               d="m 2.3228345,14.074026 -4.8,4.8 a 1.9940411,1.9940411 0 0 0 2.81999999,2.82 l 4.80000001,-4.8 z"
               id="path829"
               transform="translate(-0.15342296,0.15342299)" /><path
               class="cls-2"
               d="M 1,10 A 9,9 0 0 0 19,10 8.637,8.637 0 0 0 18.64,7.5 8.992,8.992 0 0 0 1.36,7.5 8.637,8.637 0 0 0 1,10 Z"
               id="path831"
               style="fill:#44aa00;fill-opacity:1"
               transform="translate(-0.15342296,0.15342299)" /><ellipse
               class="cls-3"
               cx="-10"
               cy="7.5"
               rx="8.6400003"
               ry="6.5"
               id="ellipse833"
               style="fill:#44d100;fill-opacity:1"
               transform="matrix(-1,0,0,1,-0.15342296,0.15342299)" /><path
               class="cls-4"
               d="m 14.590872,10.232885 a 1,1 0 0 0 1,-0.9999999 6.006,6.006 0 0 0 -5.9999999,-6 1,1 0 0 0 0,2 4,4 0 0 1 3.9999999,4 1,1 0 0 0 1,0.9999999 z"
               id="path835"
               transform="translate(-0.15342296,0.15342299)" /><g
               data-name="Layer 4"
               id="Layer_4"
               transform="translate(23.831703,1.5342298)"><path
                 class="cls-5"
                 d="m -23.039465,12.527219 a 10.022,10.022 0 1 1 4.234,4.234 l -4.254,4.255 a 2.9942454,2.9942454 0 1 1 -4.239,-4.23 z M -6.1834653,7.9032193 A 8,8 0 1 0 -14.183465,15.903219 8.009,8.009 0 0 0 -6.1834653,7.9032193 Z M -25.883465,19.611219 a 1,1 0 0 0 1.4,0 l 3.967,-3.968 a 10.092,10.092 0 0 1 -1.4,-1.406 l -3.972,3.966 a 0.976,0.976 0 0 0 0.009,1.407 z"
                 id="path838"
                 style="fill:#1a1a1a" /></g></g></g></g></g></g></svg>
