<?xml version="1.0" encoding="UTF-8" standalone="no"?>
<svg
   viewBox="0 0 256 256"
   version="1.1"
   id="svg12"
   sodipodi:docname="row_add_before.svg"
   inkscape:version="1.1.2 (0a00cf5339, 2022-02-04, custom)"
   xmlns:inkscape="http://www.inkscape.org/namespaces/inkscape"
   xmlns:sodipodi="http://sodipodi.sourceforge.net/DTD/sodipodi-0.dtd"
   xmlns="http://www.w3.org/2000/svg"
   xmlns:svg="http://www.w3.org/2000/svg">
  <defs
     id="defs16" />
  <sodipodi:namedview
     id="namedview14"
     pagecolor="#505050"
     bordercolor="#ffffff"
     borderopacity="1"
     inkscape:pageshadow="0"
     inkscape:pageopacity="0"
     inkscape:pagecheckerboard="1"
     showgrid="false"
     inkscape:zoom="1.6230469"
     inkscape:cx="162.34898"
     inkscape:cy="122.6089"
     inkscape:window-width="1920"
     inkscape:window-height="1017"
     inkscape:window-x="-1928"
     inkscape:window-y="-8"
     inkscape:window-maximized="1"
     inkscape:current-layer="svg12" />
  <rect
     fill="none"
     height="256"
     width="256"
     id="rect2" />
  <g
     id="g1913"
     transform="translate(0.61612225,-9.0878455)">
    <rect
       style="fill:#ff9955;stroke-width:10;paint-order:markers fill stroke"
       id="rect1754"
       width="192.88568"
       height="45.352589"
       x="31.383875"
       y="82.493378" />
    <rect
       style="fill:#ffaaaa;stroke-width:10;paint-order:markers fill stroke"
       id="rect1730"
       width="191.34537"
       height="60.197353"
       x="31.383875"
       y="130.49338" />
    <path
       d="M 31.383875,82.493381 H 223.38387 V 183.68231 c 0,4.41828 -3.58172,8 -8,8 H 39.383875 c -4.418278,0 -8,-3.58172 -8,-8 z"
       fill="none"
       stroke="#000000"
       stroke-linecap="round"
       stroke-linejoin="round"
       stroke-width="12"
       id="path4"
       sodipodi:nodetypes="ccssssc" />
    <line
       fill="none"
       stroke="#000000"
       stroke-linecap="round"
       stroke-linejoin="round"
       stroke-width="12"
       x1="31.383875"
       x2="223.38388"
       y1="130.49338"
       y2="130.49338"
       id="line6" />
    <rect
       style="fill:#000000;stroke-width:10;paint-order:markers fill stroke"
       id="rect1544"
       width="12.322503"
       height="110.2864"
       x="85.025269"
       y="81.020454" />
    <rect
       style="fill:#000000;stroke-width:10;paint-order:markers fill stroke"
       id="rect1544-6"
       width="12.322503"
       height="110.2864"
       x="150.64259"
       y="81.328522" />
  </g>
  <g
     id="g935"
     transform="matrix(4.4727866,0,0,4.4727866,149.97111,-4602.9055)">
    <path
       d="m 22.090416,1041.4 c 0,5.523 -4.477,10 -10,10 -5.5228003,0 -10.0000003,-4.477 -10.0000003,-10 0,-5.5228 4.4772,-10 10.0000003,-10 5.523,0 10,4.4772 10,10 z"
       fill="#2ecc71"
       id="path929"
       style="fill:#e6e6e6" />
    <path
       d="m 6.0905157,1043.4 h 4.9999003 v 5 h 2 v -5 h 5 v -2 h -5 v -5 h -2 v 5 H 6.0905157 Z"
       fill="#27ae60"
       id="path931"
       style="fill:#205600;fill-opacity:1" />
    <path
       d="m 6.0904157,1042.4 h 5.0000003 v 5 h 2 v -5 h 5 v -2 h -5 v -5 h -2 v 5 H 6.0904157 Z"
       fill="#ecf0f1"
       id="path933"
       style="fill:#44aa00;fill-opacity:1" />
  </g>
</svg>
