<?xml version="1.0" encoding="UTF-8" standalone="no"?>
<!-- Uploaded to: SVG Repo, www.svgrepo.com, Transformed by: SVG Repo Mixer Tools -->

<svg
   width="800px"
   height="800px"
   viewBox="0 0 48 48"
   version="1.1"
   id="svg11"
   sodipodi:docname="mail_new.svg"
   inkscape:version="1.1.2 (0a00cf5339, 2022-02-04, custom)"
   xmlns:inkscape="http://www.inkscape.org/namespaces/inkscape"
   xmlns:sodipodi="http://sodipodi.sourceforge.net/DTD/sodipodi-0.dtd"
   xmlns="http://www.w3.org/2000/svg"
   xmlns:svg="http://www.w3.org/2000/svg"
   xmlns:rdf="http://www.w3.org/1999/02/22-rdf-syntax-ns#"
   xmlns:cc="http://creativecommons.org/ns#"
   xmlns:dc="http://purl.org/dc/elements/1.1/">
  <defs
     id="defs15" />
  <sodipodi:namedview
     id="namedview13"
     pagecolor="#505050"
     bordercolor="#ffffff"
     borderopacity="1"
     inkscape:pageshadow="0"
     inkscape:pageopacity="0"
     inkscape:pagecheckerboard="1"
     showgrid="false"
     inkscape:zoom="0.519375"
     inkscape:cx="453.4296"
     inkscape:cy="227.19615"
     inkscape:window-width="1920"
     inkscape:window-height="1017"
     inkscape:window-x="-1928"
     inkscape:window-y="-8"
     inkscape:window-maximized="1"
     inkscape:current-layer="Q3_icons-5" />
  <title
     id="title2">mail-new-solid</title>
  <g
     id="Layer_2"
     data-name="Layer 2">
    <g
       id="Q3_icons"
       data-name="Q3 icons"
       style="fill:#333333" />
    <g
       id="Q3_icons-5"
       data-name="Q3 icons"
       style="fill:#333333"
       transform="translate(-2.8880866,12.476495)">
      <g
         id="g2329"
         transform="matrix(0.90084538,0,0,0.90084538,2.5131313,0.41385217)">
        <path
           style="fill:#b3b3b3;fill-opacity:1;stroke:none;stroke-width:1.97406;stroke-linejoin:round;paint-order:markers fill stroke"
           d="M 24.169781,8.6242265 6.4697814,19.924148 l 17.6999996,10.2 17.700004,-10.2 z"
           id="path1293"
           transform="translate(2.8880866,-12.476495)" />
        <g
           id="g2318">
          <g
             id="g2310">
            <g
               id="g2303">
              <g
                 id="g2651"
                 transform="matrix(0.80374856,0,0,0.80374856,-34.541741,-12.394624)"
                 style="stroke-width:1.00001;stroke-miterlimit:4;stroke-dasharray:none">
                <path
                   style="fill:#ffffff;fill-opacity:1;stroke:none;stroke-width:1.00001;stroke-linejoin:round;stroke-miterlimit:4;stroke-dasharray:none;stroke-opacity:1;paint-order:markers fill stroke"
                   d="m 63.476188,4.4937951 h 18.972657 0.0078 0.01953 c 0.32,0 0.592391,0.162484 0.775391,0.396484 l 9.830078,9.8281249 c 0.235,0.183 0.394532,0.455391 0.394532,0.775391 v 0.02148 0.0059 30.972656 c 0,2.209 -1.791,4 -4.000001,4 h -26 c -2.209,0 -4,-1.791 -4,-4 V 8.4938311 c 0,-2.209 1.791,-4 4,-4 z"
                   id="path2459" />
                <path
                   clip-rule="evenodd"
                   d="m 89.476644,50.494404 h -26 c -2.209,0 -4,-1.791 -4,-4 V 8.494405 c 0,-2.209 1.791,-4 4,-4 h 18.973 c 0.002,0 0.005,0 0.007,0 h 0.02 v 0 c 0.32,0 0.593,0.161 0.776,0.395 l 9.829,9.828999 c 0.235,0.183 0.395,0.456 0.395,0.776 v 0 0.021 c 0,0.002 0,0.003 0,0.005 v 30.974 c 0,2.209 -1.791,4 -4,4 z m -6,-42.618999 v 6.618999 h 6.619 z m 8,8.618999 h -9 c -0.553,0 -1,-0.448 -1,-1 V 6.494405 h -18 c -1.104,0 -2,0.896 -2,2 v 37.999999 c 0,1.104 0.896,2 2,2 h 26 c 1.104,0 2,-0.896 2,-2 z m -6,26 h -18 c -0.553,0 -1,-0.447 -1,-1 0,-0.552 0.447,-1 1,-1 h 18 c 0.553,0 1,0.448 1,1 0,0.553 -0.447,1 -1,1 z m 0,-8 h -18 c -0.553,0 -1,-0.447 -1,-1 0,-0.552 0.447,-1 1,-1 h 18 c 0.553,0 1,0.448 1,1 0,0.553 -0.447,1 -1,1 z m 0,-8 h -18 c -0.553,0 -1,-0.447 -1,-1 0,-0.552 0.447,-1 1,-1 h 18 c 0.553,0 1,0.448 1,1 0,0.553 -0.447,1 -1,1 z"
                   fill-rule="evenodd"
                   id="path844"
                   style="fill:#999999;fill-opacity:1;stroke:none;stroke-width:1.00001;stroke-miterlimit:4;stroke-dasharray:none;stroke-opacity:1" />
              </g>
              <path
                 id="path7"
                 style="fill:#e6e6e6;stroke-width:1"
                 d="M 40.589977,0.05898104 V 4.7867938 l 4.167891,2.6608596 -17.7,10.1999996 L 9.3578679,7.4476534 13.262438,4.9548406 V 0.22655924 L 5.0579069,5.447614 v 26.000039 c -2.14e-5,1.104555 0.8953678,1.999996 1.9999219,2.000039 H 47.057906 c 1.104555,-4.2e-5 1.999944,-0.895484 1.999923,-2.000039 V 5.447614 Z"
                 sodipodi:nodetypes="cccccccccccccc" />
            </g>
          </g>
        </g>
      </g>
      <path
         d="m 22.748906,-0.36474071 1.443638,-2.16545809 c 0.135042,-0.215725 0.166209,-0.480644 0.08492,-0.72182 -0.0741,-0.24427 -0.265249,-0.435423 -0.509519,-0.509519 l -2.505138,-1.019039 -0.2123,-2.5051381 c -0.0077,-0.244039 -0.115125,-0.474247 -0.29722,-0.636899 -0.208952,-0.149458 -0.474331,-0.1962889 -0.721819,-0.12738 l -2.674978,0.551979 -1.740856,-1.9531579 c -0.358765,-0.334388 -0.915036,-0.334388 -1.2738,0 l -1.740858,1.9531579 -2.6749779,-0.551979 c -0.247488,-0.06891 -0.512867,-0.02208 -0.721819,0.12738 -0.182095,0.162652 -0.289526,0.39286 -0.29722,0.636899 l -0.2123,2.5051381 -2.505138,1.019039 c -0.24427,0.0741 -0.4354229,0.265249 -0.5095189,0.509519 -0.08129,0.241176 -0.05012,0.506095 0.08492,0.72182 L 7.2085601,-0.36474071 5.7649222,1.8007176 c -0.272798,0.453114 -0.0695,1.042674 0.4245989,1.231339 l 2.505138,1.019039 0.2123,2.505138 c 0.0077,0.244039 0.115125,0.474247 0.29722,0.6369 0.208952,0.149457 0.474331,0.196289 0.721819,0.127379 l 2.6749779,-0.551979 1.740858,1.910698 c 0.338076,0.383342 0.935723,0.383342 1.2738,0 l 1.740856,-1.910698 2.674978,0.551979 c 0.247488,0.06891 0.512867,0.02208 0.721819,-0.127379 0.182095,-0.162653 0.289526,-0.392861 0.29722,-0.6369 l 0.2123,-2.505138 2.505138,-1.019039 c 0.4941,-0.188665 0.697397,-0.778225 0.424599,-1.231339 z"
         id="path7-1"
         style="fill:#ff6600;stroke-width:0.4246"
         sodipodi:nodetypes="ccccccccccccccccccccccccccccccccccccc" />
    </g>
  </g>
  <metadata
     id="metadata852">
    <rdf:RDF>
      <cc:Work
         rdf:about="">
        <dc:title>mail-new-solid</dc:title>
      </cc:Work>
    </rdf:RDF>
  </metadata>
</svg>
