<?xml version="1.0" encoding="UTF-8" standalone="no"?>
<!-- Uploaded to: SVG Repo, www.svgrepo.com, Transformed by: SVG Repo Mixer Tools -->

<svg
   version="1.1"
   id="Uploaded to svgrepo.com"
   width="800px"
   height="800px"
   viewBox="0 0 32 32"
   xml:space="preserve"
   sodipodi:docname="unlock.svg"
   inkscape:version="1.1.2 (0a00cf5339, 2022-02-04, custom)"
   xmlns:inkscape="http://www.inkscape.org/namespaces/inkscape"
   xmlns:sodipodi="http://sodipodi.sourceforge.net/DTD/sodipodi-0.dtd"
   xmlns="http://www.w3.org/2000/svg"
   xmlns:svg="http://www.w3.org/2000/svg"><defs
   id="defs25" /><sodipodi:namedview
   id="namedview23"
   pagecolor="#505050"
   bordercolor="#ffffff"
   borderopacity="1"
   inkscape:pageshadow="0"
   inkscape:pageopacity="0"
   inkscape:pagecheckerboard="1"
   showgrid="false"
   inkscape:zoom="0.519375"
   inkscape:cx="694.10349"
   inkscape:cy="425.51143"
   inkscape:window-width="1920"
   inkscape:window-height="1017"
   inkscape:window-x="-1928"
   inkscape:window-y="-8"
   inkscape:window-maximized="1"
   inkscape:current-layer="g20" />
<style
   type="text/css"
   id="style2">
	.avocado_een{fill:#231F20;}
	.avocado_twintig{fill:#EAD13F;}
	.avocado_negentien{fill:#E0A838;}
	.avocado_twee{fill:#3D3935;}
	.st0{fill:#CC4121;}
	.st1{fill:#FFFAEE;}
	.st2{fill:#D1712A;}
	.st3{fill:#A3AEB5;}
	.st4{fill:#788287;}
	.st5{fill:#C3CC6A;}
	.st6{fill:#6F9B45;}
	.st7{fill:#248EBC;}
	.st8{fill:#8D3E93;}
	.st9{fill:#D36781;}
	.st10{fill:#E598A3;}
	.st11{fill:#716558;}
	.st12{fill:#AF9480;}
	.st13{fill:#DBD2C1;}
	.st14{fill:#231F20;}
</style>
<g
   id="g20">
	<rect
   style="fill:#808080;stroke-width:0.628;stroke-linejoin:round;stroke-miterlimit:4;stroke-dasharray:none;paint-order:markers fill stroke"
   id="rect1255"
   width="32"
   height="32"
   x="0"
   y="0" /><g
   id="g16-2"
   transform="translate(-6.4120354,0.72381244)"><g
     id="g14-5"><path
       class="avocado_negentien"
       d="m 11.02,9.48 0,5.02349 h -2 L 9.02,9.48 c 0,-3.584 2.916,-6.5 6.5,-6.5 3.584,0 6.5,2.916 6.5,6.5 v 5.5 h -2 v -5.5 c 0,-2.481 -2.019,-4.5 -4.5,-4.5 -2.481,0 -4.5,2.019 -4.5,4.5 z"
       id="path12-2"
       sodipodi:nodetypes="sccsssccsss"
       style="fill:#4d4d4d" /></g></g><path
   class="avocado_een"
   d="m 16.087966,15.223824 v -5.000005 c 0,-3.8660062 -3.134,-7.0000062 -7.0000007,-7.0000062 -3.8659997,0 -7.0000007,3.134 -7.0000007,7.0000062 v 5.000005 c 1,0 13.0000014,0 14.0000014,0 z M 3.0879646,10.223819 c 0,-3.3080062 2.692001,-6.0000062 6.0000007,-6.0000062 3.3080007,0 6.0000007,2.692 6.0000007,6.0000062 v 5.000005 h -1 v -5.000005 c 0,-2.7570062 -2.243,-5.0000062 -5.0000007,-5.0000062 -2.7569997,0 -5.0000007,2.243 -5.0000007,5.0000062 v 5.000005 h -1 z M 13.087966,15.223824 H 5.0879656 v -5.000005 c 0,-2.2090062 1.791,-4.0000062 3.9999997,-4.0000062 2.2090007,0 4.0000007,1.791 4.0000007,4.0000062 z"
   id="path18-9"
   style="fill:#231f20;stroke-width:0.628;stroke-miterlimit:4;stroke-dasharray:none"
   sodipodi:nodetypes="csssccsssccsssccsccsssc" /><g
   id="g6"
   transform="translate(4.0818291,1.2322503)"
   style="fill:#ff8080">
		<rect
   x="5.5"
   y="14.5"
   class="avocado_twintig"
   width="21"
   height="15"
   id="rect4"
   style="fill:#ff8080" />
	</g>
	<g
   id="g10"
   transform="translate(4.0818291,1.2322503)">
		<path
   class="avocado_twee"
   d="m 16.575,21.423 0.272,-0.187 C 17.256,20.956 17.5,20.494 17.5,20 c 0,-0.827 -0.673,-1.5 -1.5,-1.5 -0.827,0 -1.5,0.673 -1.5,1.5 0,0.494 0.244,0.956 0.653,1.237 l 0.272,0.187 -0.815,4.076 h 2.78 z"
   id="path8"
   style="fill:#808080" />
	</g>
	
	<path
   class="avocado_een"
   d="m 9.0818291,15.23225 v 16 H 31.081829 v -16 c -21.9999999,0 0,0 -21.9999999,0 z m 20.9999999,15 h -20 v -14 h 20 z m -8,-9 c 0,-1.105 -0.895,-2 -2,-2 -1.105,0 -2,0.895 -2,2 0,0.685 0.345,1.288 0.87,1.649 l -0.87,4.351 h 4 l -0.87,-4.351 c 0.525,-0.361 0.87,-0.964 0.87,-1.649 z m -1.851,1.845 0.631,3.155 h -1.56 l 0.631,-3.155 0.129,-0.647 -0.544,-0.373 c -0.273,-0.188 -0.436,-0.496 -0.436,-0.825 0,-0.551 0.449,-1 1,-1 0.551,0 1,0.449 1,1 0,0.329 -0.163,0.637 -0.436,0.825 l -0.544,0.373 z"
   id="path18"
   style="stroke-width:0.628;stroke-miterlimit:4;stroke-dasharray:none"
   sodipodi:nodetypes="ccccccccccsssccccsccccccsssccc" />
</g>
</svg>
