<?xml version="1.0" encoding="UTF-8" standalone="no"?>
<!-- Uploaded to: SVG Repo, www.svgrepo.com, Generator: SVG Repo Mixer Tools -->

<svg
   width="800px"
   height="800px"
   viewBox="0 0 64 64"
   aria-hidden="true"
   role="img"
   class="iconify iconify--emojione"
   preserveAspectRatio="xMidYMid meet"
   version="1.1"
   id="svg6"
   sodipodi:docname="status_gestoppt.svg"
   inkscape:version="1.2.2 (1:1.2.2+202212051550+b0a8486541)"
   xmlns:inkscape="http://www.inkscape.org/namespaces/inkscape"
   xmlns:sodipodi="http://sodipodi.sourceforge.net/DTD/sodipodi-0.dtd"
   xmlns="http://www.w3.org/2000/svg"
   xmlns:svg="http://www.w3.org/2000/svg">
  <defs
     id="defs10" />
  <sodipodi:namedview
     id="namedview8"
     pagecolor="#505050"
     bordercolor="#ffffff"
     borderopacity="1"
     inkscape:pageshadow="0"
     inkscape:pageopacity="0"
     inkscape:pagecheckerboard="1"
     showgrid="false"
     inkscape:zoom="0.519375"
     inkscape:cx="-16.365824"
     inkscape:cy="524.66907"
     inkscape:window-width="1920"
     inkscape:window-height="980"
     inkscape:window-x="0"
     inkscape:window-y="27"
     inkscape:window-maximized="1"
     inkscape:current-layer="svg6"
     inkscape:showpageshadow="2"
     inkscape:deskcolor="#505050" />
  <path
     sodipodi:type="star"
     style="fill:#ff2a2a;stroke:none;stroke-width:10;paint-order:markers fill stroke;fill-opacity:1"
     id="path962"
     inkscape:flatsided="true"
     sodipodi:sides="8"
     sodipodi:cx="186.76294"
     sodipodi:cy="148.25511"
     sodipodi:r1="209.9471"
     sodipodi:r2="193.96584"
     sodipodi:arg1="-1.5707963"
     sodipodi:arg2="-1.1780972"
     inkscape:rounded="0"
     inkscape:randomized="0"
     d="M 186.76295,-61.691986 335.21796,-0.19990086 396.71004,148.25512 335.21795,296.71013 186.76293,358.20221 38.307919,296.71012 -23.184158,148.25511 38.307927,-0.19990881 Z"
     transform="matrix(0.12004266,0.04972333,-0.04972333,0.12004266,16.605641,4.7240436)" />
  <text
     xml:space="preserve"
     style="font-style:normal;font-weight:normal;font-size:17.6343px;line-height:1.25;font-family:sans-serif;fill:#ffffff;fill-opacity:1;stroke:none;stroke-width:0.440858"
     x="8.4804239"
     y="38.304264"
     id="text2622"><tspan
       sodipodi:role="line"
       id="tspan2620"
       style="fill:#ffffff;stroke-width:0.440858"
       x="8.4804239"
       y="38.304264">STOP</tspan></text>
</svg>
