<?xml version="1.0" encoding="UTF-8" standalone="no"?>
<svg
   height="24"
   viewBox="0 0 24 24"
   width="24"
   version="1.1"
   id="svg4"
   sodipodi:docname="cube_add.svg"
   inkscape:version="1.1.2 (0a00cf5339, 2022-02-04, custom)"
   inkscape:export-filename="C:\Users\bened\Desktop\helium\lpclientpc\src\com\lp\client\res\original\cube.png"
   inkscape:export-xdpi="64"
   inkscape:export-ydpi="64"
   xmlns:inkscape="http://www.inkscape.org/namespaces/inkscape"
   xmlns:sodipodi="http://sodipodi.sourceforge.net/DTD/sodipodi-0.dtd"
   xmlns="http://www.w3.org/2000/svg"
   xmlns:svg="http://www.w3.org/2000/svg">
  <defs
     id="defs8" />
  <sodipodi:namedview
     id="namedview6"
     pagecolor="#505050"
     bordercolor="#ffffff"
     borderopacity="1"
     inkscape:pageshadow="0"
     inkscape:pageopacity="0"
     inkscape:pagecheckerboard="1"
     showgrid="false"
     inkscape:zoom="17.3125"
     inkscape:cx="17.126354"
     inkscape:cy="11.3213"
     inkscape:window-width="1920"
     inkscape:window-height="1017"
     inkscape:window-x="-1928"
     inkscape:window-y="-8"
     inkscape:window-maximized="1"
     inkscape:current-layer="g935" />
  <path
     style="fill:#83e700;stroke:none;stroke-width:1.06065;stroke-linejoin:round;stroke-opacity:1;paint-order:markers fill stroke;fill-opacity:1"
     d="M 3.5148018,8.3288778 V 16.615204 L 10.93935,19.913163 V 11.628908 Z"
     id="path1132" />
  <path
     style="fill:#83e700;stroke:none;stroke-width:1.06065;stroke-linejoin:round;stroke-opacity:1;paint-order:markers fill stroke;fill-opacity:1"
     d="M 12,3.6160295 5.0664164,6.6964714 12,9.7769133 13.38796,9.1616536 18.933584,6.6964714 Z"
     id="path1130" />
  <path
     d="M 2.0235281,5.7274522 11.569376,1.484853 a 1.0617104,1.0617104 0 0 1 0.862309,0 l 9.545848,4.2425992 c 0.02121,0.00955 0.03606,0.025456 0.05728,0.037123 0.0297,0.014849 0.06152,0.024395 0.08909,0.042426 0.02333,0.01591 0.04137,0.036062 0.06364,0.053032 a 0.92276533,0.92276533 0 0 1 0.201524,0.2057661 c 0.02121,0.029698 0.04349,0.056214 0.06258,0.085913 a 1.1868671,1.1868671 0 0 1 0.08061,0.1750073 c 0.0095,0.028638 0.02439,0.055154 0.03288,0.083791 a 1.0744382,1.0744382 0 0 1 0.04136,0.2863754 v 10.606498 c 0,0.420017 -0.246071,0.798669 -0.630026,0.969434 l -9.545848,4.242599 C 12.29274,22.576935 12.14637,22.606633 12,22.606633 a 1.0574679,1.0574679 0 0 1 -0.426381,-0.101822 l -0.0042,0.01061 -9.5458479,-4.242599 A 1.0595892,1.0595892 0 0 1 1.3935022,17.303384 V 6.6968861 A 1.0595892,1.0595892 0 0 1 2.0235281,5.7274522 Z M 12,3.6156985 5.0654718,6.6968861 12,9.7780738 13.38733,9.1618363 18.933468,6.6968861 Z M 10.93935,19.913643 V 11.628908 L 3.5148018,8.3292262 v 8.2857958 z"
     id="path2"
     style="fill:#44aa00;stroke:none;stroke-width:1.06065;stroke-opacity:1;fill-opacity:1" />
  <path
     style="fill:#83e700;stroke:none;stroke-width:1.06065;stroke-linejoin:round;stroke-opacity:1;paint-order:markers fill stroke;fill-opacity:1"
     d="m 20.935113,8.3671677 v 8.2863263 l -7.424548,3.297959 v -8.284255 z"
     id="path1132-8" />
  <g
     id="g935"
     transform="matrix(0.63885164,0,0,0.63885164,9.7245915,-648.00775)">
    <path
       d="m 22.090416,1041.4 c 0,5.523 -4.477,10 -10,10 -5.5228003,0 -10.0000003,-4.477 -10.0000003,-10 0,-5.5228 4.4772,-10 10.0000003,-10 5.523,0 10,4.4772 10,10 z"
       fill="#2ecc71"
       id="path929"
       style="fill:#e6e6e6" />
    <path
       d="m 6.0905157,1043.4 h 4.9999003 v 5 h 2 v -5 h 5 v -2 h -5 v -5 h -2 v 5 H 6.0905157 Z"
       fill="#27ae60"
       id="path931"
       style="fill:#205600;fill-opacity:1" />
    <path
       d="m 6.0904157,1042.4 h 5.0000003 v 5 h 2 v -5 h 5 v -2 h -5 v -5 h -2 v 5 H 6.0904157 Z"
       fill="#ecf0f1"
       id="path933"
       style="fill:#44aa00;fill-opacity:1" />
  </g>
</svg>
