<?xml version="1.0" encoding="UTF-8" standalone="no"?>
<!-- Uploaded to: SVG Repo, www.svgrepo.com, Transformed by: SVG Repo Mixer Tools -->

<svg
   width="800px"
   height="800px"
   viewBox="0 0 24 24"
   version="1.1"
   id="svg9"
   sodipodi:docname="history_delete.svg"
   inkscape:version="1.1.2 (0a00cf5339, 2022-02-04, custom)"
   xmlns:inkscape="http://www.inkscape.org/namespaces/inkscape"
   xmlns:sodipodi="http://sodipodi.sourceforge.net/DTD/sodipodi-0.dtd"
   xmlns="http://www.w3.org/2000/svg"
   xmlns:svg="http://www.w3.org/2000/svg"
   xmlns:rdf="http://www.w3.org/1999/02/22-rdf-syntax-ns#"
   xmlns:cc="http://creativecommons.org/ns#"
   xmlns:dc="http://purl.org/dc/elements/1.1/">
  <defs
     id="defs13" />
  <sodipodi:namedview
     id="namedview11"
     pagecolor="#505050"
     bordercolor="#ffffff"
     borderopacity="1"
     inkscape:pageshadow="0"
     inkscape:pageopacity="0"
     inkscape:pagecheckerboard="1"
     showgrid="false"
     inkscape:zoom="0.519375"
     inkscape:cx="418.77256"
     inkscape:cy="452.46691"
     inkscape:window-width="1920"
     inkscape:window-height="1017"
     inkscape:window-x="-1928"
     inkscape:window-y="-8"
     inkscape:window-maximized="1"
     inkscape:current-layer="paper_line" />
  <title
     id="title2">paper_line</title>
  <g
     id="页面-1"
     stroke="none"
     stroke-width="1"
     fill="none"
     fill-rule="evenodd">
    <g
       id="File"
       transform="translate(-816.000000, 0.000000)"
       fill-rule="nonzero">
      <g
         id="paper_line"
         transform="translate(816.000000, 0.000000)">
        <g
           id="g1590"
           transform="matrix(1.1241641,0,0,1.1241641,-1.586788,-1.2553405)">
          <path
             style="fill:#ffffff;stroke-width:0.039977;stroke-linejoin:round;paint-order:markers fill stroke"
             d="M 18.509117,3.5974888 H 8.8132743 c -1.408294,0 -2.559394,1.1008159 -2.639819,2.4889065 l -0.0045,0.1554049 v 8.8143368 h -0.661078 c -0.57051,0 -1.039679,0.433524 -1.096098,0.989138 l -0.0057,0.112693 v 1.542481 c 0,1.408294 1.100779,2.559393 2.488907,2.639818 l 0.155404,0.0045 h 8.8143637 c 1.408251,0 2.55939,-1.100779 2.639818,-2.488906 l 0.0046,-0.155406 V 8.8861117 h 1.542484 c 0.570476,0 1.039675,-0.4335991 1.096098,-0.9891893 l 0.0057,-0.1126414 V 6.2418002 c 0,-1.4082516 -1.100816,-2.5593899 -2.488907,-2.6398181 z"
             id="path1059" />
          <path
             d="m 8.8132903,3.5974687 c -1.408294,0 -2.559398,1.1008479 -2.639823,2.4889385 l -0.0045,0.155373 v 8.8143728 h -0.661078 c -0.57051,0 -1.039689,0.433523 -1.096108,0.989137 l -0.0057,0.112659 v 1.542516 c 0,1.408294 1.100807,2.559397 2.488934,2.639822 l 0.155378,0.0045 h 8.8143997 c 1.408251,0 2.559393,-1.100807 2.639822,-2.488934 l 0.0045,-0.155377 V 8.8860914 h 1.54251 c 0.570477,0 1.039685,-0.4335532 1.096108,-0.9891433 l 0.0057,-0.1126529 v -1.542515 c 0,-1.4082517 -1.100848,-2.5593944 -2.488939,-2.6398226 l -0.155372,-0.00449 z m 0,1.7628743 h 7.9329347 v 12.340122 c 0,0.486817 -0.394638,0.881437 -0.881438,0.881437 -0.4868,0 -0.881437,-0.39462 -0.881437,-0.881437 v -1.542516 c 0,-0.608544 -0.493287,-1.101796 -1.101796,-1.101796 H 7.9318533 V 6.2417802 c 0,-0.4868001 0.394619,-0.8814372 0.881437,-0.8814372 z m -2.644313,11.458684 h 7.0514987 v 0.881438 c 0,0.309031 0.05306,0.605723 0.150461,0.881437 H 7.0504153 c -0.486817,0 -0.881438,-0.39462 -0.881438,-0.881437 z m 6.1700607,-5.288624 c -0.486817,0 -0.881437,0.394621 -0.881437,0.881439 0,0.486817 0.39462,0.881437 0.881437,0.881437 h 1.762875 c 0.4868,0 0.881437,-0.39462 0.881437,-0.881437 0,-0.486818 -0.394637,-0.881439 -0.881437,-0.881439 z M 10.576164,8.0046545 c -0.486818,0 -0.8814367,0.3946371 -0.8814367,0.8814369 0,0.4868002 0.3946187,0.8814369 0.8814367,0.8814369 h 3.525749 c 0.4868,0 0.881437,-0.3946367 0.881437,-0.8814369 0,-0.4867998 -0.394637,-0.8814369 -0.881437,-0.8814369 z M 18.509099,5.360343 c 0.452028,0 0.82459,0.3402738 0.875507,0.7786438 l 0.0059,0.1027934 v 0.8814372 h -0.881437 z"
             id="形状"
             fill="#09244b"
             style="stroke-width:0.881437;fill:#1a1a1a" />
        </g>
        <g
           style="fill:#000000;stroke:#000000"
           id="g1586"
           transform="matrix(0.02236828,0,0,0.02236828,2.7693014,0.64309792)">
          <g
             id="SVGRepo_bgCarrier"
             stroke-width="0" />
          <g
             id="SVGRepo_iconCarrier">
            <g
               id="g1318"
               transform="matrix(1.1861203,0,0,1.1861203,-47.646797,-71.679373)">
              <path
                 fill="#FB5046"
                 d="m 256,64.394 c -117.011,0 -211.863,94.852 -211.863,211.863 0,117.011 94.852,211.872 211.863,211.872 117.011,0 211.863,-94.861 211.863,-211.872 C 467.863,159.246 373.011,64.394 256,64.394"
                 id="path9"
                 style="fill:#808080;stroke:none" />
              <path
                 fill="#f9f9f8"
                 d="m 83.765,276.261 c 0,94.973 77.267,172.239 172.239,172.239 94.972,0 172.23,-77.267 172.23,-172.239 0,-94.972 -77.258,-172.239 -172.23,-172.239 -94.972,0 -172.239,77.267 -172.239,172.239"
                 id="path11"
                 style="stroke:none" />
              <path
                 fill="#6B8DA1"
                 d="m 256,289.451 h 123.172 c 6.11,0 11.071,-4.96 11.071,-11.079 0,-6.11 -4.961,-11.07 -11.071,-11.07 H 256 c -6.119,0 -11.08,4.961 -11.08,11.07 0,6.118 4.961,11.079 11.08,11.079"
                 id="path13"
                 style="fill:#1a1a1a;stroke:none" />
              <path
                 fill="#6B8DA1"
                 d="m 256,289.451 c 6.119,0 11.08,-4.96 11.08,-11.079 V 157.844 c 0,-6.119 -4.961,-11.08 -11.08,-11.08 -6.119,0 -11.08,4.961 -11.08,11.08 v 120.527 c 0,6.119 4.961,11.08 11.08,11.08"
                 id="path15"
                 style="fill:#1a1a1a;stroke:none" />
            </g>
          </g>
        </g>
        <g
           id="g1727"
           transform="matrix(0.67259928,0,0,0.67259928,0.24585838,11.598612)">
          <path
             d="M 9.000062,1 C 4.5810617,1 1.0000617,4.582 1.0000617,9 c 0,4.418 3.581,8 8.0000003,8 4.419,0 8,-3.582 8,-8 0,-4.418 -3.581,-8 -8,-8 z m 3.707,10.293 c 0.391,0.391 0.391,1.023 0,1.414 -0.195,0.195 -0.451,0.293 -0.707,0.293 -0.256,0 -0.512,-0.098 -0.707,-0.293 l -2.293,-2.293 -2.293,2.293 c -0.195,0.195 -0.451,0.293 -0.707,0.293 -0.256,0 -0.512,-0.098 -0.707,-0.293 -0.391,-0.391 -0.391,-1.023 0,-1.414 L 7.586062,9 5.293062,6.707 c -0.391,-0.391 -0.391,-1.023 0,-1.414 0.391,-0.391 1.023,-0.391 1.414,0 l 2.293,2.293 2.293,-2.293 c 0.391,-0.391 1.023,-0.391 1.414,0 0.391,0.391 0.391,1.023 0,1.414 L 10.414062,9 Z"
             id="path2"
             style="fill:#e6e6e6;fill-opacity:1" />
          <path
             style="fill:#aa0000;fill-opacity:1;stroke-linejoin:round;paint-order:markers fill stroke"
             d="m 6.0000622,5.653528 c -0.25575,0 -0.5115313,0.097469 -0.7070312,0.2929688 -0.391,0.3909999 -0.3910001,1.0230622 0,1.4140622 L 7.5860002,9.653528 5.293031,11.946496 c -0.391,0.391 -0.3910001,1.023062 0,1.414062 0.195,0.195 0.4510312,0.292969 0.7070312,0.292969 0.256,0 0.512031,-0.09797 0.707031,-0.292969 l 2.2929688,-2.292969 2.292968,2.292969 c 0.195,0.195 0.451031,0.292969 0.707031,0.292969 0.256001,0 0.512032,-0.09797 0.707032,-0.292969 0.391,-0.391 0.391,-1.023062 0,-1.414062 L 10.414125,9.653528 12.707093,7.360559 c 0.391,-0.391 0.391,-1.0230622 0,-1.4140622 -0.391,-0.391 -1.023062,-0.3910001 -1.414062,0 L 9.000062,8.239466 6.7070932,5.9464968 c -0.1955,-0.1955 -0.451281,-0.2929688 -0.707031,-0.2929688 z"
             id="path955-6" />
          <path
             style="fill:#ff2a2a;fill-opacity:1;stroke-linejoin:round;paint-order:markers fill stroke"
             d="M 6,5 C 5.74425,5 5.4884687,5.097469 5.2929688,5.2929688 c -0.391,0.3909999 -0.3910001,1.0230622 0,1.4140622 L 7.585938,9 5.2929688,11.292969 c -0.391,0.391 -0.3910001,1.023062 0,1.414062 C 5.4879688,12.902031 5.744,13 6,13 6.256,13 6.512031,12.90203 6.707031,12.707031 L 9,10.414062 11.292969,12.707031 C 11.487969,12.902031 11.744,13 12,13 c 0.256,0 0.512031,-0.09797 0.707031,-0.292969 0.391,-0.391 0.391,-1.023062 0,-1.414062 L 10.414062,9 12.707031,6.707031 c 0.391,-0.391 0.391,-1.0230622 0,-1.4140622 -0.391,-0.391 -1.023062,-0.3910001 -1.414062,0 L 9,7.585938 6.707031,5.2929688 C 6.511531,5.0974688 6.25575,5 6,5 Z"
             id="path955" />
        </g>
      </g>
    </g>
  </g>
  <metadata
     id="metadata830">
    <rdf:RDF>
      <cc:Work
         rdf:about="">
        <dc:title>paper_line</dc:title>
      </cc:Work>
    </rdf:RDF>
  </metadata>
</svg>
