<?xml version="1.0" encoding="UTF-8" standalone="no"?>
<!-- Uploaded to: SVG Repo, www.svgrepo.com, Transformed by: SVG Repo Mixer Tools -->

<svg
   height="800px"
   width="800px"
   version="1.1"
   id="Layer_1"
   viewBox="0 0 512 512"
   xml:space="preserve"
   sodipodi:docname="factory.svg"
   inkscape:version="1.1.2 (0a00cf5339, 2022-02-04, custom)"
   xmlns:inkscape="http://www.inkscape.org/namespaces/inkscape"
   xmlns:sodipodi="http://sodipodi.sourceforge.net/DTD/sodipodi-0.dtd"
   xmlns="http://www.w3.org/2000/svg"
   xmlns:svg="http://www.w3.org/2000/svg"><defs
   id="defs85" /><sodipodi:namedview
   id="namedview83"
   pagecolor="#505050"
   bordercolor="#ffffff"
   borderopacity="1"
   inkscape:pageshadow="0"
   inkscape:pageopacity="0"
   inkscape:pagecheckerboard="1"
   showgrid="false"
   inkscape:zoom="0.519375"
   inkscape:cx="378.33935"
   inkscape:cy="238.7485"
   inkscape:window-width="1920"
   inkscape:window-height="1017"
   inkscape:window-x="-1928"
   inkscape:window-y="-8"
   inkscape:window-maximized="1"
   inkscape:current-layer="g74" />
<g
   id="g80">
	
	
	
	
	
	
	
	
	<g
   id="g1021"
   transform="translate(40.66468,40.66426)"><polygon
     style="fill:#962b23"
     points="25.599,401.067 25.599,503.467 486.399,503.467 486.399,401.067 "
     id="polygon2"
     transform="scale(0.84115523)" /><polygon
     style="fill:#c0562b;fill-opacity:1"
     points="25.599,298.667 25.599,401.067 486.399,401.067 486.399,298.667 "
     id="polygon4"
     transform="scale(0.84115523)" /><g
     id="g12"
     transform="scale(0.84115523)">
		<polygon
   style="fill:#962b23"
   points="349.866,196.267 349.866,298.667 486.399,298.667 486.399,196.267 "
   id="polygon6" />
		<path
   style="fill:#962b23"
   d="M 145.067,298.667 H 59.733 V 139.008 C 59.733,132.932 64.665,128 70.741,128 h 63.317 c 6.076,0 11.008,4.932 11.008,11.008 v 159.659 z"
   id="path8" />
		<path
   style="fill:#962b23"
   d="M 290.133,298.667 H 204.8 V 139.008 c 0,-6.076 4.932,-11.008 11.008,-11.008 h 63.317 c 6.076,0 11.008,4.932 11.008,11.008 z"
   id="path10" />
	</g><g
     id="g20"
     transform="scale(0.84115523)">
		<path
   style="fill:#bdc3c7"
   d="m 119.467,76.8 c -4.71,0 -8.533,-3.814 -8.533,-8.533 0,-9.412 -7.654,-17.067 -17.067,-17.067 H 25.6 C 11.486,51.2 0,39.714 0,25.6 0,11.486 11.486,0 25.6,0 h 34.133 c 4.71,0 8.533,3.814 8.533,8.533 0,4.719 -3.823,8.533 -8.533,8.533 H 25.6 c -4.702,0 -8.533,3.823 -8.533,8.533 0,4.71 3.831,8.533 8.533,8.533 h 68.267 c 18.825,0 34.133,15.309 34.133,34.133 0,4.721 -3.823,8.535 -8.533,8.535"
   id="path14" />
		<path
   style="fill:#bdc3c7"
   d="m 281.6,76.8 c -4.71,0 -8.533,-3.814 -8.533,-8.533 C 273.067,58.855 265.413,51.2 256,51.2 h -68.267 c -14.114,0 -25.6,-11.486 -25.6,-25.6 0,-14.114 11.486,-25.6 25.6,-25.6 h 34.133 c 4.71,0 8.533,3.814 8.533,8.533 0,4.719 -3.823,8.533 -8.533,8.533 h -34.133 c -4.702,0 -8.533,3.823 -8.533,8.533 0,4.71 3.831,8.533 8.533,8.533 H 256 c 18.825,0 34.133,15.309 34.133,34.133 0,4.721 -3.823,8.535 -8.533,8.535"
   id="path16" />
		<path
   style="fill:#bdc3c7"
   d="m 443.733,76.8 c -4.71,0 -8.533,-3.814 -8.533,-8.533 0,-9.412 -7.654,-17.067 -17.067,-17.067 h -42.667 c -14.114,0 -25.6,-11.486 -25.6,-25.6 0,-14.114 11.487,-25.6 25.601,-25.6 H 409.6 c 4.71,0 8.533,3.814 8.533,8.533 0,4.719 -3.823,8.533 -8.533,8.533 h -34.133 c -4.702,0 -8.533,3.823 -8.533,8.533 0,4.71 3.831,8.533 8.533,8.533 h 42.667 c 18.825,0 34.133,15.309 34.133,34.133 0,4.721 -3.823,8.535 -8.534,8.535"
   id="path18" />
	</g><polygon
     style="fill:#c0562b;fill-opacity:1"
     points="383.999,136.533 383.999,196.267 452.266,196.267 452.266,136.533 "
     id="polygon22"
     transform="scale(0.84115523)" /><g
     id="g48"
     transform="scale(0.84115523)">
		<path
   style="fill:#962b23"
   d="m 68.267,375.467 c -4.71,0 -8.533,-3.814 -8.533,-8.533 V 332.8 c 0,-4.719 3.823,-8.533 8.533,-8.533 4.71,0 8.533,3.814 8.533,8.533 v 34.133 c 0,4.719 -3.823,8.534 -8.533,8.534"
   id="path24" />
		<path
   style="fill:#962b23"
   d="m 102.4,375.467 c -4.71,0 -8.533,-3.814 -8.533,-8.533 V 332.8 c 0,-4.719 3.823,-8.533 8.533,-8.533 4.71,0 8.533,3.814 8.533,8.533 v 34.133 c 0,4.719 -3.823,8.534 -8.533,8.534"
   id="path26" />
		<path
   style="fill:#962b23"
   d="m 136.533,375.467 c -4.71,0 -8.533,-3.814 -8.533,-8.533 V 332.8 c 0,-4.719 3.823,-8.533 8.533,-8.533 4.71,0 8.533,3.814 8.533,8.533 v 34.133 c 0.001,4.719 -3.822,8.534 -8.533,8.534"
   id="path28" />
		<path
   style="fill:#962b23"
   d="m 170.667,375.467 c -4.71,0 -8.533,-3.814 -8.533,-8.533 V 332.8 c 0,-4.719 3.823,-8.533 8.533,-8.533 4.71,0 8.533,3.814 8.533,8.533 v 34.133 c 0,4.719 -3.823,8.534 -8.533,8.534"
   id="path30" />
		<path
   style="fill:#962b23"
   d="m 204.8,375.467 c -4.71,0 -8.533,-3.814 -8.533,-8.533 V 332.8 c 0,-4.719 3.823,-8.533 8.533,-8.533 4.71,0 8.533,3.814 8.533,8.533 v 34.133 c 0,4.719 -3.823,8.534 -8.533,8.534"
   id="path32" />
		<path
   style="fill:#962b23"
   d="m 238.933,375.467 c -4.71,0 -8.533,-3.814 -8.533,-8.533 V 332.8 c 0,-4.719 3.823,-8.533 8.533,-8.533 4.71,0 8.533,3.814 8.533,8.533 v 34.133 c 0.001,4.719 -3.822,8.534 -8.533,8.534"
   id="path34" />
		<path
   style="fill:#962b23"
   d="m 273.067,375.467 c -4.71,0 -8.533,-3.814 -8.533,-8.533 V 332.8 c 0,-4.719 3.823,-8.533 8.533,-8.533 4.71,0 8.533,3.814 8.533,8.533 v 34.133 c 0,4.719 -3.823,8.534 -8.533,8.534"
   id="path36" />
		<path
   style="fill:#962b23"
   d="m 307.2,375.467 c -4.71,0 -8.533,-3.814 -8.533,-8.533 V 332.8 c 0,-4.719 3.823,-8.533 8.533,-8.533 4.71,0 8.533,3.814 8.533,8.533 v 34.133 c 0,4.719 -3.823,8.534 -8.533,8.534"
   id="path38" />
		<path
   style="fill:#962b23"
   d="m 341.333,375.467 c -4.71,0 -8.533,-3.814 -8.533,-8.533 V 332.8 c 0,-4.719 3.823,-8.533 8.533,-8.533 4.71,0 8.533,3.814 8.533,8.533 v 34.133 c 0.001,4.719 -3.822,8.534 -8.533,8.534"
   id="path40" />
		<path
   style="fill:#962b23"
   d="m 375.467,375.467 c -4.71,0 -8.533,-3.814 -8.533,-8.533 V 332.8 c 0,-4.719 3.823,-8.533 8.533,-8.533 4.71,0 8.533,3.814 8.533,8.533 v 34.133 c 0,4.719 -3.823,8.534 -8.533,8.534"
   id="path42" />
		<path
   style="fill:#962b23"
   d="m 409.6,375.467 c -4.71,0 -8.533,-3.814 -8.533,-8.533 V 332.8 c 0,-4.719 3.823,-8.533 8.533,-8.533 4.71,0 8.533,3.814 8.533,8.533 v 34.133 c 0,4.719 -3.823,8.534 -8.533,8.534"
   id="path44" />
		<path
   style="fill:#962b23"
   d="m 443.733,375.467 c -4.71,0 -8.533,-3.814 -8.533,-8.533 V 332.8 c 0,-4.719 3.823,-8.533 8.533,-8.533 4.71,0 8.533,3.814 8.533,8.533 v 34.133 c 10e-4,4.719 -3.822,8.534 -8.533,8.534"
   id="path46" />
	</g><g
     id="g74"
     transform="scale(0.84115523)"
     style="stroke-width:0.9997679;stroke-miterlimit:4;stroke-dasharray:none">
		<path
   style="fill:#c0562b;stroke-width:0.9997679;stroke-miterlimit:4;stroke-dasharray:none;fill-opacity:1"
   d="m 68.267,477.867 c -4.71,0 -8.533,-3.814 -8.533,-8.533 V 435.2 c 0,-4.719 3.823,-8.533 8.533,-8.533 4.71,0 8.533,3.814 8.533,8.533 v 34.133 c 0,4.719 -3.823,8.534 -8.533,8.534"
   id="path50" />
		<path
   style="fill:#c0562b;stroke-width:0.9997679;stroke-miterlimit:4;stroke-dasharray:none;fill-opacity:1"
   d="m 102.4,477.867 c -4.71,0 -8.533,-3.814 -8.533,-8.533 V 435.2 c 0,-4.719 3.823,-8.533 8.533,-8.533 4.71,0 8.533,3.814 8.533,8.533 v 34.133 c 0,4.719 -3.823,8.534 -8.533,8.534"
   id="path52" />
		<path
   style="fill:#c0562b;stroke-width:0.9997679;stroke-miterlimit:4;stroke-dasharray:none;fill-opacity:1"
   d="m 136.533,477.867 c -4.71,0 -8.533,-3.814 -8.533,-8.533 V 435.2 c 0,-4.719 3.823,-8.533 8.533,-8.533 4.71,0 8.533,3.814 8.533,8.533 v 34.133 c 0.001,4.719 -3.822,8.534 -8.533,8.534"
   id="path54" />
		<path
   style="fill:#c0562b;stroke-width:0.9997679;stroke-miterlimit:4;stroke-dasharray:none;fill-opacity:1"
   d="m 170.667,477.867 c -4.71,0 -8.533,-3.814 -8.533,-8.533 V 435.2 c 0,-4.719 3.823,-8.533 8.533,-8.533 4.71,0 8.533,3.814 8.533,8.533 v 34.133 c 0,4.719 -3.823,8.534 -8.533,8.534"
   id="path56" />
		<path
   style="fill:#c0562b;stroke-width:0.9997679;stroke-miterlimit:4;stroke-dasharray:none;fill-opacity:1"
   d="m 204.8,477.867 c -4.71,0 -8.533,-3.814 -8.533,-8.533 V 435.2 c 0,-4.719 3.823,-8.533 8.533,-8.533 4.71,0 8.533,3.814 8.533,8.533 v 34.133 c 0,4.719 -3.823,8.534 -8.533,8.534"
   id="path58" />
		<path
   style="fill:#c0562b;stroke-width:0.9997679;stroke-miterlimit:4;stroke-dasharray:none;fill-opacity:1"
   d="m 238.933,477.867 c -4.71,0 -8.533,-3.814 -8.533,-8.533 V 435.2 c 0,-4.719 3.823,-8.533 8.533,-8.533 4.71,0 8.533,3.814 8.533,8.533 v 34.133 c 0.001,4.719 -3.822,8.534 -8.533,8.534"
   id="path60" />
		<path
   style="fill:#c0562b;stroke-width:0.9997679;stroke-miterlimit:4;stroke-dasharray:none;fill-opacity:1"
   d="m 273.067,477.867 c -4.71,0 -8.533,-3.814 -8.533,-8.533 V 435.2 c 0,-4.719 3.823,-8.533 8.533,-8.533 4.71,0 8.533,3.814 8.533,8.533 v 34.133 c 0,4.719 -3.823,8.534 -8.533,8.534"
   id="path62" />
		<path
   style="fill:#c0562b;stroke-width:0.9997679;stroke-miterlimit:4;stroke-dasharray:none;fill-opacity:1"
   d="m 307.2,477.867 c -4.71,0 -8.533,-3.814 -8.533,-8.533 V 435.2 c 0,-4.719 3.823,-8.533 8.533,-8.533 4.71,0 8.533,3.814 8.533,8.533 v 34.133 c 0,4.719 -3.823,8.534 -8.533,8.534"
   id="path64" />
		<path
   style="fill:#c0562b;stroke-width:0.9997679;stroke-miterlimit:4;stroke-dasharray:none;fill-opacity:1"
   d="m 341.333,477.867 c -4.71,0 -8.533,-3.814 -8.533,-8.533 V 435.2 c 0,-4.719 3.823,-8.533 8.533,-8.533 4.71,0 8.533,3.814 8.533,8.533 v 34.133 c 0.001,4.719 -3.822,8.534 -8.533,8.534"
   id="path66" />
		<path
   style="fill:#c0562b;stroke-width:0.9997679;stroke-miterlimit:4;stroke-dasharray:none;fill-opacity:1"
   d="m 375.467,477.867 c -4.71,0 -8.533,-3.814 -8.533,-8.533 V 435.2 c 0,-4.719 3.823,-8.533 8.533,-8.533 4.71,0 8.533,3.814 8.533,8.533 v 34.133 c 0,4.719 -3.823,8.534 -8.533,8.534"
   id="path68" />
		<path
   style="fill:#c0562b;stroke-width:0.9997679;stroke-miterlimit:4;stroke-dasharray:none;fill-opacity:1"
   d="m 409.6,477.867 c -4.71,0 -8.533,-3.814 -8.533,-8.533 V 435.2 c 0,-4.719 3.823,-8.533 8.533,-8.533 4.71,0 8.533,3.814 8.533,8.533 v 34.133 c 0,4.719 -3.823,8.534 -8.533,8.534"
   id="path70" />
		<path
   style="fill:#c0562b;stroke-width:0.9997679;stroke-miterlimit:4;stroke-dasharray:none;fill-opacity:1"
   d="m 443.733,477.867 c -4.71,0 -8.533,-3.814 -8.533,-8.533 V 435.2 c 0,-4.719 3.823,-8.533 8.533,-8.533 4.71,0 8.533,3.814 8.533,8.533 v 34.133 c 10e-4,4.719 -3.822,8.534 -8.533,8.534"
   id="path72" />
	</g><polygon
     style="fill:#962b23"
     points="366.932,102.4 366.932,136.533 469.333,136.533 469.333,102.4 "
     id="polygon76"
     transform="scale(0.84115523)" /><path
     style="fill:#c0562b;stroke-width:0.841155;fill-opacity:1"
     d="M 423.4939,430.67148 H 7.1775776 C 3.2157365,430.67148 0,427.46331 0,423.4939 c 0,-3.96941 3.2157365,-7.17758 7.1775776,-7.17758 H 423.49306 c 3.96184,0 7.17758,3.20817 7.17758,7.17758 8.4e-4,3.96941 -3.2149,7.17758 -7.17674,7.17758"
     id="path78" /></g>
</g>
</svg>
