<?xml version="1.0" encoding="UTF-8" standalone="no"?>
<!-- Created with Inkscape (http://www.inkscape.org/) -->

<svg
   width="800"
   height="800"
   viewBox="0 0 211.66666 211.66667"
   version="1.1"
   id="svg834"
   inkscape:version="1.1.2 (0a00cf5339, 2022-02-04, custom)"
   sodipodi:docname="key1_add.svg"
   xmlns:inkscape="http://www.inkscape.org/namespaces/inkscape"
   xmlns:sodipodi="http://sodipodi.sourceforge.net/DTD/sodipodi-0.dtd"
   xmlns="http://www.w3.org/2000/svg"
   xmlns:svg="http://www.w3.org/2000/svg">
  <sodipodi:namedview
     id="namedview836"
     pagecolor="#505050"
     bordercolor="#ffffff"
     borderopacity="1"
     inkscape:pageshadow="0"
     inkscape:pageopacity="0"
     inkscape:pagecheckerboard="1"
     inkscape:document-units="mm"
     showgrid="false"
     units="px"
     width="800px"
     inkscape:zoom="0.52347032"
     inkscape:cx="390.66207"
     inkscape:cy="586.47069"
     inkscape:window-width="1920"
     inkscape:window-height="1017"
     inkscape:window-x="-1928"
     inkscape:window-y="-8"
     inkscape:window-maximized="1"
     inkscape:current-layer="layer1" />
  <defs
     id="defs831" />
  <g
     inkscape:label="Ebene 1"
     inkscape:groupmode="layer"
     id="layer1">
    <path
       id="path12963"
       inkscape:connector-curvature="0"
       d="m 47.802922,48.190585 c -24.593545,8.498898 -37.64415,35.323622 -29.145253,59.917165 8.498854,24.59342 35.328784,37.64239 59.922329,29.14349 21.939432,-7.58171 34.684292,-29.74789 31.146732,-51.903983 0.0422,-0.01245 0.085,-0.01984 0.12728,-0.03245 l 17.14591,-5.925186 8.55404,24.753089 18.93015,-6.541774 -8.55403,-24.753091 8.92608,-3.084625 12.37995,35.82428 18.93016,-6.541775 -12.38,-35.824413 10.35965,-3.580029 -6.54168,-18.929889 -75.0088,25.921115 c -0.0424,0.01887 -0.0832,0.03614 -0.12532,0.05484 C 90.891081,49.187391 68.553675,41.019658 47.802922,48.190585 Z m 7.119124,20.600849 c 13.21562,-4.566979 27.628439,2.442751 32.195417,15.65837 C 91.684399,97.665299 84.676447,112.08328 71.460827,116.65026 58.24521,121.21724 43.82545,114.20412 39.258514,100.98863 34.691536,87.773009 41.706564,73.358365 54.922046,68.791434 Z"
       style="fill:#ffaa35;fill-opacity:1;stroke-width:0.143535" />
    <g
       id="g935"
       transform="matrix(4.8015604,0,0,4.8015604,96.713231,-4850.2498)">
      <path
         d="m 22.090416,1041.4 c 0,5.523 -4.477,10 -10,10 -5.5228003,0 -10.0000003,-4.477 -10.0000003,-10 0,-5.5228 4.4772,-10 10.0000003,-10 5.523,0 10,4.4772 10,10 z"
         fill="#2ecc71"
         id="path929"
         style="fill:#e6e6e6" />
      <path
         d="m 6.0905157,1043.4 h 4.9999003 v 5 h 2 v -5 h 5 v -2 h -5 v -5 h -2 v 5 H 6.0905157 Z"
         fill="#27ae60"
         id="path931"
         style="fill:#205600;fill-opacity:1" />
      <path
         d="m 6.0904157,1042.4 h 5.0000003 v 5 h 2 v -5 h 5 v -2 h -5 v -5 h -2 v 5 H 6.0904157 Z"
         fill="#ecf0f1"
         id="path933"
         style="fill:#44aa00;fill-opacity:1" />
    </g>
  </g>
</svg>
