<?xml version="1.0" encoding="UTF-8" standalone="no"?>
<svg
   xmlns:dc="http://purl.org/dc/elements/1.1/"
   xmlns:cc="http://creativecommons.org/ns#"
   xmlns:rdf="http://www.w3.org/1999/02/22-rdf-syntax-ns#"
   xmlns:svg="http://www.w3.org/2000/svg"
   xmlns="http://www.w3.org/2000/svg"
   xmlns:sodipodi="http://sodipodi.sourceforge.net/DTD/sodipodi-0.dtd"
   xmlns:inkscape="http://www.inkscape.org/namespaces/inkscape"
   id="shortnail"
   viewBox="0 0 12.5 12.5"
   version="1.1"
   sodipodi:docname="nail.svg"
   width="12.5"
   height="12.5"
   inkscape:version="0.92.5 (2060ec1f9f, 2020-04-08)">
  <metadata
     id="metadata906">
    <rdf:RDF>
      <cc:Work
         rdf:about="">
        <dc:format>image/svg+xml</dc:format>
        <dc:type
           rdf:resource="http://purl.org/dc/dcmitype/StillImage" />
        <dc:title></dc:title>
      </cc:Work>
    </rdf:RDF>
  </metadata>
  <sodipodi:namedview
     pagecolor="#ffffff"
     bordercolor="#666666"
     borderopacity="1"
     objecttolerance="10"
     gridtolerance="10"
     guidetolerance="10"
     inkscape:pageopacity="0"
     inkscape:pageshadow="2"
     inkscape:window-width="1920"
     inkscape:window-height="980"
     id="namedview904"
     showgrid="false"
     inkscape:zoom="32.208836"
     inkscape:cx="8.0978468"
     inkscape:cy="3.4497314"
     inkscape:window-x="0"
     inkscape:window-y="27"
     inkscape:window-maximized="1"
     inkscape:current-layer="shortnail" />
  <defs
     id="defs891">
    <style
       id="style889">.cls-1{fill:#777;}.cls-2{fill:#b2b2b2;}</style>
  </defs>
  <g
     id="g4616"
     transform="matrix(0.8572822,0,0,0.8572822,3.6267165,0.89198617)">
    <polygon
       transform="translate(0,0.05000019)"
       style="fill:#777777"
       id="polygon895"
       points="3.32,9.65 3.36,11.34 4.2,8.52 4.2,8.21 3.63,8.71 "
       class="cls-1" />
    <polygon
       transform="translate(0,0.05000019)"
       style="fill:#777777"
       id="polygon897"
       points="2.86,11.46 2.81,9.65 2.5,8.71 1.93,8.21 1.93,8.52 2.77,11.38 "
       class="cls-1" />
    <polygon
       transform="translate(0,0.05000019)"
       style="fill:#b2b2b2"
       id="polygon899"
       points="5.62,1.48 5.62,0.84 5.18,0.51 0.94,0.51 0.51,0.84 0.51,1.48 1.93,2.71 1.93,7.53 2.94,8.42 3.06,8.8 3.19,8.42 4.2,7.53 4.2,2.71 "
       class="cls-2" />
    <path
       inkscape:connector-curvature="0"
       id="path901"
       d="m 0.76,0.05000019 -0.76,0.6 V 1.7700002 l 1.42,1.23 v 5.61 L 2.33,11.71 3.15,12.45 3.8,11.64 4.7,8.6400002 v -5.65 l 1.42,-1.23 V 0.64000019 l -0.76,-0.59 z M 2.76,11.43 1.91,8.5700002 v -0.31 l 0.57,0.5 0.31,0.94 V 11.5 Z M 4.19,8.5700002 3.36,11.39 V 9.7000002 l 0.31,-0.94 0.57,-0.5 v 0.31 z m 1.42,-7 -1.42,1.23 v 4.82 l -1,0.89 -0.13,0.34 -0.12,-0.4 -1,-0.89 v -4.8 l -1.42,-1.23 V 0.89000019 l 0.43,-0.34 H 5.2 l 0.43,0.34 V 1.5300002 Z" />
  </g>
</svg>
