<?xml version="1.0" encoding="UTF-8" standalone="no"?>
<svg
   viewBox="0 0 256 256"
   version="1.1"
   id="svg14"
   sodipodi:docname="printer2.svg"
   inkscape:version="1.1.2 (0a00cf5339, 2022-02-04, custom)"
   xmlns:inkscape="http://www.inkscape.org/namespaces/inkscape"
   xmlns:sodipodi="http://sodipodi.sourceforge.net/DTD/sodipodi-0.dtd"
   xmlns="http://www.w3.org/2000/svg"
   xmlns:svg="http://www.w3.org/2000/svg">
  <g
     id="g1231"
     transform="matrix(0.80199281,0,0,1,25.524523,-5.5451263)" />
  <defs
     id="defs18" />
  <sodipodi:namedview
     id="namedview16"
     pagecolor="#505050"
     bordercolor="#ffffff"
     borderopacity="1"
     inkscape:pageshadow="0"
     inkscape:pageopacity="0"
     inkscape:pagecheckerboard="1"
     showgrid="false"
     inkscape:zoom="1.1476675"
     inkscape:cx="86.697587"
     inkscape:cy="95.846578"
     inkscape:window-width="1920"
     inkscape:window-height="1017"
     inkscape:window-x="-1928"
     inkscape:window-y="-8"
     inkscape:window-maximized="1"
     inkscape:current-layer="svg14" />
  <g
     id="g3496"
     transform="matrix(1.2624977,0,0,1.2624977,-33.826451,-20.904595)">
    <path
       style="fill:#666666;fill-opacity:1;stroke-width:1.846;paint-order:markers fill stroke"
       d="m 62.778299,87.999999 c -5.45789,0 -9.30078,3.92728 -9.30078,8 V 136.57762 H 82.12025 V 152 c 4.41e-4,-4.4181 3.581905,-7.99956 8,-8 h 74.22301 c 4.4181,4.4e-4 7.99956,3.5819 8,8 v -15.42238 h 29.02685 V 95.999999 c 0,-4.07272 -3.84289,-8 -9.30078,-8 H 173.37011 81.477519 Z"
       id="path1984"
       sodipodi:nodetypes="ssccccccccssccs"
       transform="matrix(0.80199281,0,0,1,25.524523,-5.5451263)" />
    <path
       style="fill:#999999;fill-opacity:1;stroke-width:2.38939;paint-order:markers fill stroke"
       d="m 95.975699,138 v 26.80589 34.17326 H 159.57641 V 164.80589 138 Z"
       id="path1988"
       sodipodi:nodetypes="ccccccc"
       transform="matrix(0.80199281,0,0,1,25.524523,-5.5451263)" />
    <path
       style="fill:#b3b3b3;fill-opacity:1;stroke-width:1.846;paint-order:markers fill stroke"
       d="m 95.591576,47.999999 v 24 h 64.368954 v -24 z"
       id="path1982"
       sodipodi:nodetypes="ccccc"
       transform="matrix(0.80199281,0,0,1,25.524523,-5.5451263)" />
    <path
       style="color:#000000;fill:#000000;stroke-linecap:round;stroke-linejoin:round;-inkscape-stroke:none"
       d="m 87.591576,31.999999 c -4.418095,4.42e-4 -7.999558,3.581905 -8,8 v 40 c 4.42e-4,4.418095 3.581905,7.999558 8,8 h 80.368954 c 4.41809,-4.42e-4 7.99956,-3.581905 8,-8 v -40 c -4.4e-4,-4.418095 -3.58191,-7.999558 -8,-8 z m 8,16 h 64.368954 v 24 H 95.591576 Z"
       id="rect6-4"
       sodipodi:nodetypes="cccccccccccccc"
       transform="matrix(0.80199281,0,0,1,25.524523,-5.5451263)" />
    <path
       style="color:#000000;fill:#000000;stroke-linecap:round;stroke-linejoin:round;-inkscape-stroke:none"
       d="m 87.975699,122 c -4.418095,4.4e-4 -7.999559,3.5819 -8,8 v 76.97915 c 4.41e-4,4.4181 3.581905,7.99956 8,8 h 79.600711 c 4.4181,-4.4e-4 7.99956,-3.5819 8,-8 V 130 c -4.4e-4,-4.4181 -3.5819,-7.99956 -8,-8 z m 8,16 h 63.600711 v 60.97915 H 95.975699 Z"
       id="rect8-6"
       sodipodi:nodetypes="cccccccccccccc"
       transform="matrix(0.80199281,0,0,1,25.524523,-5.5451263)" />
    <path
       style="color:#000000;fill:#000000;stroke-linecap:round;stroke-linejoin:round;-inkscape-stroke:none"
       d="m 64.313814,71.999999 c -13.54209,0 -25.30078,10.47274 -25.30078,24 v 48.577621 c 4.42e-4,4.4181 3.581905,7.99956 8,8 h 35.424788 c 4.418278,0 8,-3.58172 8,-8 0,-4.41828 -3.581722,-8 -8,-8 H 55.013034 V 95.999999 c 0,-4.07272 3.84289,-8 9.30078,-8 H 191.68618 c 5.45789,0 9.30078,3.92728 9.30078,8 v 40.577621 h -31.266 c -4.41828,0 -8,3.58172 -8,8 0,4.41828 3.58172,8 8,8 h 39.266 c 4.4181,-4.4e-4 7.99956,-3.5819 8,-8 V 95.999999 c 0,-13.52726 -11.75869,-24 -25.30078,-24 z"
       id="path10-3"
       sodipodi:nodetypes="ssccssscsssscsssccsss"
       transform="matrix(0.80199281,0,0,1,25.524523,-5.5451263)" />
    <rect
       style="fill:#ffffff;stroke-width:2.06132;paint-order:markers fill stroke"
       id="rect2399"
       width="57.504601"
       height="24.040913"
       x="99.023758"
       y="142"
       transform="matrix(0.80199281,0,0,1,25.524523,-5.5451263)" />
    <rect
       style="fill:#ffffff;stroke-width:2.06132;paint-order:markers fill stroke"
       id="rect2399-0"
       width="57.504601"
       height="24.040913"
       x="99.023758"
       y="48"
       transform="matrix(0.80199281,0,0,1,25.524523,-5.5451263)" />
    <rect
       style="fill:#ffffff;stroke-width:2.06132;paint-order:markers fill stroke"
       id="rect2399-2"
       width="57.504601"
       height="24.040913"
       x="99.023758"
       y="170.53911"
       transform="matrix(0.80199281,0,0,1,25.524523,-5.5451263)" />
    <circle
       cx="173.69537"
       cy="96.246628"
       id="circle12-2"
       r="8.7325029"
       style="stroke-width:0.727709" />
  </g>
</svg>
