<?xml version="1.0" encoding="UTF-8" standalone="no"?>
<!-- Uploaded to: SVG Repo, www.svgrepo.com, Transformed by: SVG Repo Mixer Tools -->

<svg
   version="1.1"
   id="Layer_1"
   viewBox="0 0 512 512"
   xml:space="preserve"
   sodipodi:docname="exit.svg"
   inkscape:version="1.1.2 (0a00cf5339, 2022-02-04, custom)"
   xmlns:inkscape="http://www.inkscape.org/namespaces/inkscape"
   xmlns:sodipodi="http://sodipodi.sourceforge.net/DTD/sodipodi-0.dtd"
   xmlns="http://www.w3.org/2000/svg"
   xmlns:svg="http://www.w3.org/2000/svg"><defs
   id="defs25" /><sodipodi:namedview
   id="namedview23"
   pagecolor="#505050"
   bordercolor="#ffffff"
   borderopacity="1"
   inkscape:pageshadow="0"
   inkscape:pageopacity="0"
   inkscape:pagecheckerboard="1"
   showgrid="false"
   inkscape:zoom="0.81152344"
   inkscape:cx="233.51143"
   inkscape:cy="211.94705"
   inkscape:window-width="1920"
   inkscape:window-height="1017"
   inkscape:window-x="-1928"
   inkscape:window-y="-8"
   inkscape:window-maximized="1"
   inkscape:current-layer="path18" />

<g
   id="g8"
   transform="translate(56.683514)">
	
	<rect
   x="155.826"
   y="91.269997"
   style="fill:#263230"
   width="100.173"
   height="340.591"
   id="rect6" />
</g>
<polygon
   style="fill:#b7b7c8"
   points="244.87,80.139 256,91.27 356.174,91.27 356.174,431.861 378.435,431.861 378.435,69.009 256,69.009 "
   id="polygon10"
   transform="translate(56.683514)" />
<polygon
   style="fill:#b7b7c8"
   points="133.565,431.861 155.826,431.861 155.826,91.27 256,91.27 256,69.009 133.565,69.009 "
   id="polygon12"
   transform="translate(56.683514)" />
<polygon
   style="fill:#afafe9"
   points="222.609,471.93 233.739,256 222.609,40.07 200.348,40.07 200.348,471.93 "
   id="polygon14"
   transform="translate(56.683514)" />
<polygon
   style="fill:#2c2ca0"
   points="289.391,65.67 267.13,256 289.391,451.896 356.174,431.861 356.174,91.27 "
   id="polygon16"
   transform="translate(56.683514)" />
<polygon
   style="fill:#5f5fd3"
   points="222.609,471.93 289.391,451.896 289.391,65.67 222.609,40.07 "
   id="polygon18"
   transform="translate(56.683514)" />
<circle
   style="fill:#502d16"
   cx="312.6835"
   cy="256"
   r="11.13"
   id="circle20" />
<g
   style="fill:#44aa00;fill-opacity:1;stroke:#000000;stroke-width:0"
   id="g1922"
   transform="matrix(0,9.7357933,-9.7357933,0,-207.08148,33.006152)"><g
     id="SVGRepo_bgCarrier"
     stroke-width="0"
     style="fill:#44aa00;fill-opacity:1" /><g
     id="SVGRepo_iconCarrier"
     style="fill:#44aa00;fill-opacity:1"><g
       id="Home"
       style="fill:#44aa00;fill-opacity:1" /><g
       id="Print"
       style="fill:#44aa00;fill-opacity:1" /><g
       id="Mail"
       style="fill:#44aa00;fill-opacity:1" /><g
       id="Camera"
       style="fill:#44aa00;fill-opacity:1" /><g
       id="Video"
       style="fill:#44aa00;fill-opacity:1" /><g
       id="Film"
       style="fill:#44aa00;fill-opacity:1" /><g
       id="Message"
       style="fill:#44aa00;fill-opacity:1" /><g
       id="Telephone"
       style="fill:#44aa00;fill-opacity:1" /><g
       id="User"
       style="fill:#44aa00;fill-opacity:1" /><g
       id="File"
       style="fill:#44aa00;fill-opacity:1" /><g
       id="Folder"
       style="fill:#44aa00;fill-opacity:1" /><g
       id="Map"
       style="fill:#44aa00;fill-opacity:1" /><g
       id="Download"
       style="fill:#44aa00;fill-opacity:1" /><g
       id="Upload"
       style="fill:#44aa00;fill-opacity:1"><path
         id="line16"
         d="M 16,29 V 28" /><g
         id="path18"><path
           id="path1633"
           style="color:#000000;fill:#44aa00;fill-opacity:1;stroke:none;stroke-width:0;-inkscape-stroke:none"
           d="m 13.256045,-44.050585 c 0.01406,0.09844 0.04529,0.198512 0.09529,0.298512 0.1,0.4 0.49995,0.600033 0.899949,0.600032 h 4.000019 v 14.999822 c 0,0.5 0.500055,1.000055 1.000056,1.000055 h 4.000019 4.000019 c 0.499999,0 0.999854,-0.500055 0.999854,-1.000055 v -14.999822 h 4.000019 c 0.5,0 1.000056,-0.400056 1.000056,-1.000054 0,-0.3 -0.200022,-0.600045 -0.400022,-0.800045 l -2.720108,-2.720109 H 16.371362 l -2.820015,2.820015 c -0.225,0.224999 -0.337489,0.506337 -0.295302,0.801649 z" /></g></g><g
       id="Video_Recorder"
       style="fill:#44aa00;fill-opacity:1" /><g
       id="Schedule"
       style="fill:#44aa00;fill-opacity:1" /><g
       id="Cart"
       style="fill:#44aa00;fill-opacity:1" /><g
       id="Setting"
       style="fill:#44aa00;fill-opacity:1" /><g
       id="Search"
       style="fill:#44aa00;fill-opacity:1" /><g
       id="Pencils"
       style="fill:#44aa00;fill-opacity:1" /><g
       id="Group"
       style="fill:#44aa00;fill-opacity:1" /><g
       id="Record"
       style="fill:#44aa00;fill-opacity:1" /><g
       id="Headphone"
       style="fill:#44aa00;fill-opacity:1" /><g
       id="Music_Player"
       style="fill:#44aa00;fill-opacity:1" /><g
       id="Sound_On"
       style="fill:#44aa00;fill-opacity:1" /><g
       id="Sound_Off"
       style="fill:#44aa00;fill-opacity:1" /><g
       id="Lock"
       style="fill:#44aa00;fill-opacity:1" /><g
       id="Lock_open"
       style="fill:#44aa00;fill-opacity:1" /><g
       id="Love"
       style="fill:#44aa00;fill-opacity:1" /><g
       id="Favorite"
       style="fill:#44aa00;fill-opacity:1" /><g
       id="Film_1_"
       style="fill:#44aa00;fill-opacity:1" /><g
       id="Music"
       style="fill:#44aa00;fill-opacity:1" /><g
       id="Puzzle"
       style="fill:#44aa00;fill-opacity:1" /><g
       id="Turn_Off"
       style="fill:#44aa00;fill-opacity:1" /><g
       id="Book"
       style="fill:#44aa00;fill-opacity:1" /><g
       id="Save"
       style="fill:#44aa00;fill-opacity:1" /><g
       id="Reload"
       style="fill:#44aa00;fill-opacity:1" /><g
       id="Trash"
       style="fill:#44aa00;fill-opacity:1" /><g
       id="Tag"
       style="fill:#44aa00;fill-opacity:1" /><g
       id="Link"
       style="fill:#44aa00;fill-opacity:1" /><g
       id="Like"
       style="fill:#44aa00;fill-opacity:1" /><g
       id="Bad"
       style="fill:#44aa00;fill-opacity:1" /><g
       id="Gallery"
       style="fill:#44aa00;fill-opacity:1" /><g
       id="Add"
       style="fill:#44aa00;fill-opacity:1" /><g
       id="Close"
       style="fill:#44aa00;fill-opacity:1" /><g
       id="Forward"
       style="fill:#44aa00;fill-opacity:1" /><g
       id="Back"
       style="fill:#44aa00;fill-opacity:1" /><g
       id="Buy"
       style="fill:#44aa00;fill-opacity:1" /><g
       id="Mac"
       style="fill:#44aa00;fill-opacity:1" /><g
       id="Laptop"
       style="fill:#44aa00;fill-opacity:1" /></g></g></svg>
