<?xml version="1.0" encoding="UTF-8" standalone="no"?>
<svg
   viewBox="0 0 512 512"
   version="1.1"
   id="svg4"
   sodipodi:docname="data.svg"
   width="512"
   height="512"
   inkscape:export-filename="C:\Users\bened\Desktop\helium\lpclientpc\src\com\lp\client\res\original\data.png"
   inkscape:export-xdpi="3"
   inkscape:export-ydpi="3"
   inkscape:version="1.1.2 (0a00cf5339, 2022-02-04, custom)"
   xmlns:inkscape="http://www.inkscape.org/namespaces/inkscape"
   xmlns:sodipodi="http://sodipodi.sourceforge.net/DTD/sodipodi-0.dtd"
   xmlns="http://www.w3.org/2000/svg"
   xmlns:svg="http://www.w3.org/2000/svg">
  <defs
     id="defs8" />
  <sodipodi:namedview
     id="namedview6"
     pagecolor="#505050"
     bordercolor="#ffffff"
     borderopacity="1"
     inkscape:pageshadow="0"
     inkscape:pageopacity="0"
     inkscape:pagecheckerboard="1"
     showgrid="false"
     inkscape:zoom="0.81152344"
     inkscape:cx="361.66546"
     inkscape:cy="277.25632"
     inkscape:window-width="1920"
     inkscape:window-height="1017"
     inkscape:window-x="-1928"
     inkscape:window-y="-8"
     inkscape:window-maximized="1"
     inkscape:current-layer="svg4" />
  <path
     d="m 459.66787,89.740644 v 41.564616 c 0,36.6293 -91.22593,66.50392 -203.66787,66.50392 -112.44194,0 -203.66787,-29.87462 -203.66787,-66.50392 V 89.740644 C 52.33213,53.111341 143.55806,23.23672 256,23.23672 c 112.44194,0 203.66787,29.874621 203.66787,66.503924 z m 0,93.520836 v 93.52083 c 0,36.6293 -91.22593,66.50392 -203.66787,66.50392 -112.44194,0 -203.66787,-29.87462 -203.66787,-66.50392 V 183.26148 C 96.088899,213.39614 176.17674,227.42467 256,227.42467 c 79.82326,0 159.91019,-14.02853 203.66787,-44.16319 z m 0,145.47705 v 93.52083 c 0,36.6293 -91.22593,66.50392 -203.66787,66.50392 -112.44194,0 -203.66787,-29.87462 -203.66787,-66.50392 V 328.73853 C 96.088899,358.87319 176.17674,372.90172 256,372.90172 c 79.82326,0 159.91019,-14.02853 203.66787,-44.16319 z"
     id="path2"
     style="stroke-width:0.909232;fill:#aaaaff" />
  <style
     type="text/css"
     id="style824">
	.st0{fill:#222A30;}
	.st1{fill:none;stroke:#222A30;stroke-width:2.0101;stroke-linejoin:round;stroke-miterlimit:10;}
	.st2{fill:#171715;}
	.st3{fill-rule:evenodd;clip-rule:evenodd;fill:#222A30;}
</style>
  <g
     id="g2334"
     transform="matrix(25.760554,0,0,25.760554,524.73449,5.2061045)"
     style="stroke:none">
    <g
       id="g2464"
       transform="matrix(0,0.83905678,-0.83905678,0,2.388623,1.7719483)">
      <path
         d="m 16.5,7 h -2.086 l 1.293,-1.293 c 0.391,-0.391 0.391,-1.023 0,-1.414 -0.391,-0.391 -1.023,-0.391 -1.414,0 L 10.586,8 14.293,11.707 C 14.488,11.902 14.744,12 15,12 c 0.256,0 0.512,-0.098 0.707,-0.293 0.391,-0.391 0.391,-1.023 0,-1.414 L 14.414,9 H 16.5 c 1.379,0 2.5,1.346 2.5,3 0,1.654 -1.346,3 -3,3 v 0 c -0.553,0 -1,0.448 -1,1 0,0.552 0.447,1 1,1 v 0 c 2.757,0 5,-2.243 5,-5 0,-2.757 -2.019,-5 -4.5,-5 z"
         id="path2323"
         style="fill:#ff2a2a;fill-opacity:1;stroke:none" />
      <path
         d="m 8.293,12.293 c -0.391,0.391 -0.391,1.023 0,1.414 L 9.586,15 H 7.5 C 6.121,15 5,13.654 5,12 5,10.346 6.346,9 8,9 V 9 C 8.553,9 9,8.552 9,8 9,7.448 8.553,7 8,7 v 0 c -2.757,0 -5,2.243 -5,5 0,2.757 2.019,5 4.5,5 h 2.086 l -1.293,1.293 c -0.391,0.391 -0.391,1.023 0,1.414 C 8.488,19.902 8.744,20 9,20 9.256,20 9.512,19.902 9.707,19.707 L 13.414,16 9.707,12.293 c -0.391,-0.391 -1.023,-0.391 -1.414,0 z"
         id="path2325"
         style="fill:#44aa00;fill-opacity:1;stroke:none" />
    </g>
  </g>
</svg>
