<?xml version="1.0" encoding="UTF-8" standalone="no"?>
<svg
   height="512px"
   id="Layer_1"
   style="enable-background:new 0 0 512 512;"
   version="1.1"
   viewBox="0 0 512 512"
   width="512px"
   xml:space="preserve"
   sodipodi:docname="gears_stop.svg"
   inkscape:version="1.1.2 (0a00cf5339, 2022-02-04, custom)"
   xmlns:inkscape="http://www.inkscape.org/namespaces/inkscape"
   xmlns:sodipodi="http://sodipodi.sourceforge.net/DTD/sodipodi-0.dtd"
   xmlns="http://www.w3.org/2000/svg"
   xmlns:svg="http://www.w3.org/2000/svg"><defs
     id="defs7" /><sodipodi:namedview
     id="namedview5"
     pagecolor="#505050"
     bordercolor="#ffffff"
     borderopacity="1"
     inkscape:pageshadow="0"
     inkscape:pageopacity="0"
     inkscape:pagecheckerboard="1"
     showgrid="false"
     inkscape:zoom="0.57383374"
     inkscape:cx="175.13784"
     inkscape:cy="284.0544"
     inkscape:window-width="1920"
     inkscape:window-height="1017"
     inkscape:window-x="-1928"
     inkscape:window-y="-8"
     inkscape:window-maximized="1"
     inkscape:current-layer="g1194" /><path
     d="m 459.33592,208.32953 h -18.32089 c -14.94599,0 -27.48133,-12.89694 -27.48133,-28.20452 0,-7.71406 3.25437,-14.70493 9.03991,-19.88781 l 11.81215,-11.57109 c 11.69162,-11.57108 11.69162,-30.49463 0,-42.06572 L 407.50709,79.962784 c -5.30341,-5.303415 -13.138,-8.437251 -21.09313,-8.437251 -7.95512,0 -15.66918,3.133836 -21.09312,8.437251 l -11.33003,11.330022 c -5.42394,6.026608 -12.65587,9.280974 -20.49046,9.280974 -15.42812,0 -28.32506,-12.535342 -28.32506,-27.360797 v -18.44142 c 0,-16.271842 -13.13801,-30.253572 -29.53038,-30.253572 h -36.64178 c -16.39237,0 -29.40984,13.861198 -29.40984,30.253572 v 18.320888 c 0,14.825455 -12.89694,27.360799 -28.32506,27.360799 -7.71406,0 -14.82546,-3.254368 -20.00834,-8.919379 L 149.56827,79.962784 c -5.30341,-5.423948 -13.138,-8.437251 -21.09312,-8.437251 -7.95513,0 -15.66918,3.133836 -21.09313,8.437251 L 80.262283,106.47986 c -11.571087,11.57108 -11.571087,30.49463 0,41.94519 l 11.330023,11.33002 c 6.026608,5.42395 9.401504,12.65588 9.401504,20.36994 0,15.42811 -12.53534,28.20452 -27.481328,28.20452 H 55.191594 c -16.512906,0 -30.374104,12.89694 -30.374104,29.28932 v 18.32088 18.32089 c 0,16.27184 13.861198,29.28932 30.374104,29.28932 h 18.320888 c 14.945988,0 27.481328,12.89694 27.481328,28.20452 0,7.71406 -3.374896,14.94599 -9.401504,20.36994 l -11.330023,11.20949 c -11.571087,11.57108 -11.571087,30.49463 0,41.94519 l 26.878667,26.75814 c 5.30342,5.42394 13.13801,8.43725 21.09313,8.43725 7.95512,0 15.66918,-3.13384 21.09313,-8.43725 l 11.69162,-11.57109 c 5.06235,-5.66501 12.29428,-8.91938 20.00834,-8.91938 15.42811,0 28.32505,12.53535 28.32505,27.3608 v 18.32089 c 0,16.27184 13.01748,30.25357 29.53038,30.25357 h 36.64178 c 16.39237,0 29.40984,-13.8612 29.40984,-30.25357 v -18.32089 c 0,-14.82545 12.89694,-27.3608 28.32506,-27.3608 7.71406,0 14.94599,3.3749 20.49047,9.28098 l 11.33002,11.33002 c 5.42395,5.30341 13.13801,8.43725 21.09313,8.43725 7.95512,0 15.66918,-3.13384 21.09313,-8.43725 l 26.87867,-26.75814 c 11.57108,-11.57109 11.57108,-30.49464 0,-42.06572 L 422.33255,351.7628 c -5.78555,-5.18288 -9.03992,-12.29428 -9.03992,-19.88781 0,-15.42811 12.53535,-28.20452 27.48134,-28.20452 h 18.32088 c 16.39238,0 28.084,-12.89694 28.084,-29.28931 v -18.44143 -18.32088 c 0.24106,-16.39238 -11.45056,-29.28932 -27.84293,-29.28932 z m -105.7067,47.6102 v 0 c 0,53.15469 -43.02998,96.42573 -96.42573,96.42573 -53.39575,0 -96.42573,-43.27104 -96.42573,-96.42573 v 0 0 c 0,-53.15468 43.02998,-96.42572 96.42573,-96.42572 53.39575,0 96.42573,43.27104 96.42573,96.42572 z"
     id="path2"
     style="fill:#e6e6e6;stroke-width:1.20532" /><g
     style="fill:none"
     id="g1194"
     transform="matrix(33.333333,0,0,33.333333,119.31419,-47.981654)"><path
       fill-rule="evenodd"
       clip-rule="evenodd"
       d="m 3.9410393,7.7897129 h 6.3938497 c 0.588554,0 1.065642,0.4771055 1.065642,1.0656418 v 6.3938503 c 0,0.588554 -0.477088,1.065642 -1.065642,1.065642 H 3.9410393 c -0.5885364,0 -1.0656421,-0.477088 -1.0656421,-1.065642 V 8.8553547 c 0,-0.5885363 0.4771057,-1.0656418 1.0656421,-1.0656418 z"
       fill="#758ca3"
       id="path1186"
       sodipodi:nodetypes="sssssssss"
       style="stroke-width:0.355214;fill:#ff2a2a;fill-opacity:1" /></g></svg>
