<?xml version="1.0" encoding="UTF-8" standalone="no"?>
<svg
   height="512px"
   id="Layer_1"
   style="enable-background:new 0 0 512 512;"
   version="1.1"
   viewBox="0 0 512 512"
   width="512px"
   xml:space="preserve"
   sodipodi:docname="media_stop.svg"
   inkscape:version="1.1.2 (0a00cf5339, 2022-02-04, custom)"
   xmlns:inkscape="http://www.inkscape.org/namespaces/inkscape"
   xmlns:sodipodi="http://sodipodi.sourceforge.net/DTD/sodipodi-0.dtd"
   xmlns="http://www.w3.org/2000/svg"
   xmlns:svg="http://www.w3.org/2000/svg"><defs
     id="defs7" /><sodipodi:namedview
     id="namedview5"
     pagecolor="#505050"
     bordercolor="#ffffff"
     borderopacity="1"
     inkscape:pageshadow="0"
     inkscape:pageopacity="0"
     inkscape:pagecheckerboard="1"
     showgrid="false"
     inkscape:zoom="0.57383374"
     inkscape:cx="175.13784"
     inkscape:cy="284.0544"
     inkscape:window-width="1920"
     inkscape:window-height="1017"
     inkscape:window-x="-1928"
     inkscape:window-y="-8"
     inkscape:window-maximized="1"
     inkscape:current-layer="Layer_1" /><rect
     style="fill:#ffffff;stroke-width:13.396;stroke-linejoin:round;paint-order:markers fill stroke"
     id="rect934"
     width="512"
     height="512"
     x="0"
     y="0" /><g
     style="fill:none"
     id="g1194"
     transform="matrix(40.487857,0,0,40.487857,-33.00087,-231.97099)"><path
       fill-rule="evenodd"
       clip-rule="evenodd"
       d="m 3.9410393,7.7897129 h 6.3938497 c 0.588554,0 1.065642,0.4771055 1.065642,1.0656418 v 6.3938503 c 0,0.588554 -0.477088,1.065642 -1.065642,1.065642 H 3.9410393 c -0.5885364,0 -1.0656421,-0.477088 -1.0656421,-1.065642 V 8.8553547 c 0,-0.5885363 0.4771057,-1.0656418 1.0656421,-1.0656418 z"
       fill="#758ca3"
       id="path1186"
       sodipodi:nodetypes="sssssssss"
       style="fill:#ff2a2a;fill-opacity:1;stroke-width:0.355214" /></g></svg>
