<?xml version="1.0" encoding="UTF-8" standalone="no"?>
<!-- Uploaded to: SVG Repo, www.svgrepo.com, Transformed by: SVG Repo Mixer Tools -->

<svg
   width="800px"
   height="800px"
   viewBox="0 0 16 16"
   version="1.1"
   id="svg4"
   sodipodi:docname="import.svg"
   inkscape:version="1.1.2 (0a00cf5339, 2022-02-04, custom)"
   xmlns:inkscape="http://www.inkscape.org/namespaces/inkscape"
   xmlns:sodipodi="http://sodipodi.sourceforge.net/DTD/sodipodi-0.dtd"
   xmlns="http://www.w3.org/2000/svg"
   xmlns:svg="http://www.w3.org/2000/svg">
  <defs
     id="defs8" />
  <sodipodi:namedview
     id="namedview6"
     pagecolor="#505050"
     bordercolor="#ffffff"
     borderopacity="1"
     inkscape:pageshadow="0"
     inkscape:pageopacity="0"
     inkscape:pagecheckerboard="1"
     showgrid="false"
     inkscape:zoom="0.519375"
     inkscape:cx="72.202166"
     inkscape:cy="494.82551"
     inkscape:window-width="1920"
     inkscape:window-height="1017"
     inkscape:window-x="-1928"
     inkscape:window-y="-8"
     inkscape:window-maximized="1"
     inkscape:current-layer="svg4" />
  <path
     fill="#000000"
     fill-rule="evenodd"
     d="m 14,9 c 0.5523,0 1,0.44772 1,1 v 3 c 0,1.1046 -0.8954,2 -2,2 H 3 C 1.89543,15 1,14.1046 1,13 V 10 C 1,9.44772 1.44772,9 2,9 2.55228,9 3,9.44771 3,10 v 3 h 10 v -3 c 0,-0.55229 0.4477,-1 1,-1 z"
     id="path2"
     sodipodi:nodetypes="sssssssssccss" />
  <g
     style="fill:#44aa00;fill-opacity:1;stroke:#000000;stroke-width:0"
     id="g1922"
     transform="matrix(-0.02859028,0,0,-0.02859028,5.0398753,7.7354229)">
    <g
       id="SVGRepo_bgCarrier"
       stroke-width="0"
       style="fill:#44aa00;fill-opacity:1" />
    <g
       id="SVGRepo_iconCarrier"
       style="fill:#44aa00;fill-opacity:1">
      <g
         id="Home"
         style="fill:#44aa00;fill-opacity:1" />
      <g
         id="Print"
         style="fill:#44aa00;fill-opacity:1" />
      <g
         id="Mail"
         style="fill:#44aa00;fill-opacity:1" />
      <g
         id="Camera"
         style="fill:#44aa00;fill-opacity:1" />
      <g
         id="Video"
         style="fill:#44aa00;fill-opacity:1" />
      <g
         id="Film"
         style="fill:#44aa00;fill-opacity:1" />
      <g
         id="Message"
         style="fill:#44aa00;fill-opacity:1" />
      <g
         id="Telephone"
         style="fill:#44aa00;fill-opacity:1" />
      <g
         id="User"
         style="fill:#44aa00;fill-opacity:1" />
      <g
         id="File"
         style="fill:#44aa00;fill-opacity:1" />
      <g
         id="Folder"
         style="fill:#44aa00;fill-opacity:1" />
      <g
         id="Map"
         style="fill:#44aa00;fill-opacity:1" />
      <g
         id="Download"
         style="fill:#44aa00;fill-opacity:1" />
      <g
         id="Upload"
         style="fill:#44aa00;fill-opacity:1">
        <line
           fill="none"
           x1="16"
           x2="16"
           y1="29"
           y2="28"
           id="line16"
           style="fill:#44aa00;fill-opacity:1" />
        <path
           d="M 21.024421,-4.7419656 -94.429151,-120.19554 c -2.594462,-2.59446 -5.188921,-3.89169 -9.080619,-3.89169 0,0 0,0 0,0 0,0 0,0 0,0 v 0 c -3.89169,0 -6.48615,1.29723 -9.08062,3.89169 l -116.7508,116.7507944 c -3.8917,3.89169503 -5.18893,9.0806218 -2.59447,14.2695486 1.29723,5.188927 6.48616,7.78339 11.67508,7.78339 h 51.88925 V 213.19286 c 0,6.48616 6.48616,12.97232 12.97231,12.97232 h 51.88925 v 0 h 51.889247 v 0 c 6.486156,0 12.972311,-6.48616 12.972311,-12.97232 V 18.608193 h 51.889246 v 0 c 6.486156,0 12.972312,-5.188927 12.972312,-12.9723168 0,-3.8916951 -2.594462,-7.7833901 -5.188925,-10.3778418 z"
           fill="#2197f3"
           id="path18"
           inkscape:export-filename="C:\Users\bened\Desktop\helium\lpclientpc\src\com\lp\client\res\svgs\arrow_down_blue.png"
           inkscape:export-xdpi="16"
           inkscape:export-ydpi="16"
           style="fill:#44aa00;fill-opacity:1;stroke-width:0" />
      </g>
      <g
         id="Video_Recorder"
         style="fill:#44aa00;fill-opacity:1" />
      <g
         id="Schedule"
         style="fill:#44aa00;fill-opacity:1" />
      <g
         id="Cart"
         style="fill:#44aa00;fill-opacity:1" />
      <g
         id="Setting"
         style="fill:#44aa00;fill-opacity:1" />
      <g
         id="Search"
         style="fill:#44aa00;fill-opacity:1" />
      <g
         id="Pencils"
         style="fill:#44aa00;fill-opacity:1" />
      <g
         id="Group"
         style="fill:#44aa00;fill-opacity:1" />
      <g
         id="Record"
         style="fill:#44aa00;fill-opacity:1" />
      <g
         id="Headphone"
         style="fill:#44aa00;fill-opacity:1" />
      <g
         id="Music_Player"
         style="fill:#44aa00;fill-opacity:1" />
      <g
         id="Sound_On"
         style="fill:#44aa00;fill-opacity:1" />
      <g
         id="Sound_Off"
         style="fill:#44aa00;fill-opacity:1" />
      <g
         id="Lock"
         style="fill:#44aa00;fill-opacity:1" />
      <g
         id="Lock_open"
         style="fill:#44aa00;fill-opacity:1" />
      <g
         id="Love"
         style="fill:#44aa00;fill-opacity:1" />
      <g
         id="Favorite"
         style="fill:#44aa00;fill-opacity:1" />
      <g
         id="Film_1_"
         style="fill:#44aa00;fill-opacity:1" />
      <g
         id="Music"
         style="fill:#44aa00;fill-opacity:1" />
      <g
         id="Puzzle"
         style="fill:#44aa00;fill-opacity:1" />
      <g
         id="Turn_Off"
         style="fill:#44aa00;fill-opacity:1" />
      <g
         id="Book"
         style="fill:#44aa00;fill-opacity:1" />
      <g
         id="Save"
         style="fill:#44aa00;fill-opacity:1" />
      <g
         id="Reload"
         style="fill:#44aa00;fill-opacity:1" />
      <g
         id="Trash"
         style="fill:#44aa00;fill-opacity:1" />
      <g
         id="Tag"
         style="fill:#44aa00;fill-opacity:1" />
      <g
         id="Link"
         style="fill:#44aa00;fill-opacity:1" />
      <g
         id="Like"
         style="fill:#44aa00;fill-opacity:1" />
      <g
         id="Bad"
         style="fill:#44aa00;fill-opacity:1" />
      <g
         id="Gallery"
         style="fill:#44aa00;fill-opacity:1" />
      <g
         id="Add"
         style="fill:#44aa00;fill-opacity:1" />
      <g
         id="Close"
         style="fill:#44aa00;fill-opacity:1" />
      <g
         id="Forward"
         style="fill:#44aa00;fill-opacity:1" />
      <g
         id="Back"
         style="fill:#44aa00;fill-opacity:1" />
      <g
         id="Buy"
         style="fill:#44aa00;fill-opacity:1" />
      <g
         id="Mac"
         style="fill:#44aa00;fill-opacity:1" />
      <g
         id="Laptop"
         style="fill:#44aa00;fill-opacity:1" />
    </g>
  </g>
</svg>
