<?xml version="1.0" encoding="UTF-8" standalone="no"?>
<svg
   width="64px"
   height="64px"
   viewBox="0 0 32 32"
   enable-background="new 0 0 32 32"
   version="1.1"
   xml:space="preserve"
   fill="#000000"
   stroke="#000000"
   stroke-width="0"
   id="svg60"
   sodipodi:docname="up_plus.svg"
   inkscape:version="1.1.2 (0a00cf5339, 2022-02-04, custom)"
   inkscape:export-filename="C:\Users\bened\Desktop\helium\lpclientpc\src\com\lp\client\res\svgs\arrow_up_blue.png"
   inkscape:export-xdpi="24"
   inkscape:export-ydpi="24"
   xmlns:inkscape="http://www.inkscape.org/namespaces/inkscape"
   xmlns:sodipodi="http://sodipodi.sourceforge.net/DTD/sodipodi-0.dtd"
   xmlns="http://www.w3.org/2000/svg"
   xmlns:svg="http://www.w3.org/2000/svg"><defs
   id="defs64" /><sodipodi:namedview
   id="namedview62"
   pagecolor="#505050"
   bordercolor="#ffffff"
   borderopacity="1"
   inkscape:pageshadow="0"
   inkscape:pageopacity="0"
   inkscape:pagecheckerboard="1"
   showgrid="false"
   inkscape:zoom="6.4921875"
   inkscape:cx="0.53910951"
   inkscape:cy="26.33935"
   inkscape:window-width="1920"
   inkscape:window-height="1017"
   inkscape:window-x="-1928"
   inkscape:window-y="-8"
   inkscape:window-maximized="1"
   inkscape:current-layer="Upload" />

<g
   id="SVGRepo_bgCarrier"
   stroke-width="0" />

<g
   id="SVGRepo_iconCarrier">

<g
   id="Home" />

<g
   id="Print" />

<g
   id="Mail" />

<g
   id="Camera" />

<g
   id="Video" />

<g
   id="Film" />

<g
   id="Message" />

<g
   id="Telephone" />

<g
   id="User" />

<g
   id="File" />

<g
   id="Folder" />

<g
   id="Map" />

<g
   id="Download" />

<g
   id="Upload">

<line
   fill="none"
   x1="16"
   x2="16"
   y1="29"
   y2="28"
   id="line16" />

<path
   d="m 25.602026,11.7 -8.9,-8.9 c -0.2,-0.2 -0.4,-0.3 -0.7,-0.3 0,0 0,0 0,0 0,0 0,0 0,0 v 0 c -0.3,0 -0.5,0.1 -0.7,0.3 l -9.0000002,9 c -0.3,0.3 -0.4,0.7 -0.2,1.1 0.1,0.4 0.5,0.6 0.9,0.6 h 4.0000002 v 15 c 0,0.5 0.5,1 1,1 h 4 v 0 h 4 v 0 c 0.5,0 1,-0.5 1,-1 v -15 h 4 v 0 c 0.5,0 1,-0.4 1,-1 0,-0.3 -0.2,-0.6 -0.4,-0.8 z"
   fill="#2197f3"
   id="path18"
   inkscape:export-filename="C:\Users\bened\Desktop\helium\lpclientpc\src\com\lp\client\res\svgs\arrow_down_blue.png"
   inkscape:export-xdpi="16"
   inkscape:export-ydpi="16" />



<g
   id="g935"
   transform="matrix(0.70378199,0,0,0.70378199,14.980754,-709.5058)"><path
     d="m 22.090416,1041.4 c 0,5.523 -4.477,10 -10,10 -5.5228003,0 -10.0000003,-4.477 -10.0000003,-10 0,-5.5228 4.4772,-10 10.0000003,-10 5.523,0 10,4.4772 10,10 z"
     fill="#2ecc71"
     id="path929"
     style="fill:#e6e6e6" /><path
     d="m 6.0905157,1043.4 h 4.9999003 v 5 h 2 v -5 h 5 v -2 h -5 v -5 h -2 v 5 H 6.0905157 Z"
     fill="#27ae60"
     id="path931"
     style="fill:#205600;fill-opacity:1" /><path
     d="m 6.0904157,1042.4 h 5.0000003 v 5 h 2 v -5 h 5 v -2 h -5 v -5 h -2 v 5 H 6.0904157 Z"
     fill="#ecf0f1"
     id="path933"
     style="fill:#44aa00;fill-opacity:1" /></g></g>

<g
   id="Video_Recorder" />

<g
   id="Schedule" />

<g
   id="Cart" />

<g
   id="Setting" />

<g
   id="Search" />

<g
   id="Pencils" />

<g
   id="Group" />

<g
   id="Record" />

<g
   id="Headphone" />

<g
   id="Music_Player" />

<g
   id="Sound_On" />

<g
   id="Sound_Off" />

<g
   id="Lock" />

<g
   id="Lock_open" />

<g
   id="Love" />

<g
   id="Favorite" />

<g
   id="Film_1_" />

<g
   id="Music" />

<g
   id="Puzzle" />

<g
   id="Turn_Off" />

<g
   id="Book" />

<g
   id="Save" />

<g
   id="Reload" />

<g
   id="Trash" />

<g
   id="Tag" />

<g
   id="Link" />

<g
   id="Like" />

<g
   id="Bad" />

<g
   id="Gallery" />

<g
   id="Add" />

<g
   id="Close" />

<g
   id="Forward" />

<g
   id="Back" />

<g
   id="Buy" />

<g
   id="Mac" />

<g
   id="Laptop" />

</g>

</svg>
