<?xml version="1.0" encoding="UTF-8" standalone="no"?>
<!-- Uploaded to: SVG Repo, www.svgrepo.com, Transformed by: SVG Repo Mixer Tools -->

<svg
   width="800px"
   height="800px"
   viewBox="0 0 24 24"
   version="1.1"
   id="svg11"
   sodipodi:docname="message.svg"
   inkscape:version="1.1.2 (0a00cf5339, 2022-02-04, custom)"
   xmlns:inkscape="http://www.inkscape.org/namespaces/inkscape"
   xmlns:sodipodi="http://sodipodi.sourceforge.net/DTD/sodipodi-0.dtd"
   xmlns="http://www.w3.org/2000/svg"
   xmlns:svg="http://www.w3.org/2000/svg"
   xmlns:rdf="http://www.w3.org/1999/02/22-rdf-syntax-ns#"
   xmlns:cc="http://creativecommons.org/ns#"
   xmlns:dc="http://purl.org/dc/elements/1.1/">
  <sodipodi:namedview
     id="namedview13"
     pagecolor="#505050"
     bordercolor="#ffffff"
     borderopacity="1"
     inkscape:pageshadow="0"
     inkscape:pageopacity="0"
     inkscape:pagecheckerboard="1"
     showgrid="false"
     inkscape:zoom="0.73450717"
     inkscape:cx="255.27321"
     inkscape:cy="385.29236"
     inkscape:window-width="1920"
     inkscape:window-height="1017"
     inkscape:window-x="-1928"
     inkscape:window-y="-8"
     inkscape:window-maximized="1"
     inkscape:current-layer="svg11" />
  <title
     id="title2">/svg/ic-message</title>
  <desc
     id="desc4">Created with Sketch.</desc>
  <defs
     id="defs6" />
  <path
     style="fill:#afc6e9;stroke-width:0.40188;stroke-linejoin:round;paint-order:markers fill stroke"
     d="M 12,4.9999807 C 7.0294371,4.9999807 3.0000001,8.134007 3.0000001,12 c 0,3.865993 4.029437,7.000019 8.9999999,7.000019 4.970562,0 9,-3.134026 9,-7.000019 0,-3.8659931 -4.029438,-7.0000193 -9,-7.0000193 z"
     id="path1086" />
  <g
     id="Page-1-9"
     stroke="none"
     stroke-width="1"
     fill="none"
     fill-rule="evenodd"
     style="fill:#000000">
    <g
       id="ic-message-6"
       fill-rule="nonzero"
       fill="#4a4a4a"
       style="fill:#000000">
      <path
         d="m 12,19 c 4.970563,0 9,-3.134007 9,-7 0,-3.8659933 -4.029437,-7 -9,-7 -4.9705628,0 -9,3.1340067 -9,7 0,3.865993 4.0294372,7 9,7 z m 0,2 v 0 C 6.0242383,21 1,17.094797 1,12 1,6.9052034 6.0242383,3 12,3 c 5.975762,0 11,3.9052034 11,9 0,5.094797 -5.024238,9 -11,9 z M 6,9 C 6,8.4477153 6.455761,8 7.0024733,8 H 16.997527 C 17.551177,8 18,8.4438648 18,9 v 0 c 0,0.5522848 -0.455761,1 -1.002473,1 H 7.0024733 C 6.4488226,10 6,9.5561352 6,9 Z m 0,3 C 6,11.447715 6.4530363,11 6.9970301,11 H 13.00297 C 13.553614,11 14,11.443865 14,12 v 0 c 0,0.552285 -0.453036,1 -0.99703,1 H 6.9970301 C 6.4463856,13 6,12.556135 6,12 Z m 0,3 C 6,14.447715 6.4437166,14 6.9998075,14 H 10.000193 C 10.552371,14 11,14.443865 11,15 c 0,0.552285 -0.443717,1 -0.999807,1 H 6.9998075 C 6.4476291,16 6,15.556135 6,15 Z m -2,2 4,3 -4,1 z"
         id="Oval-1"
         style="fill:#000000" />
    </g>
  </g>
  <g
     id="Page-1"
     stroke="none"
     stroke-width="1"
     fill="none"
     fill-rule="evenodd">
    <g
       id="ic-message"
       fill-rule="nonzero"
       fill="#4A4A4A" />
  </g>
  <metadata
     id="metadata830">
    <rdf:RDF>
      <cc:Work
         rdf:about="">
        <dc:title>/svg/ic-message</dc:title>
      </cc:Work>
    </rdf:RDF>
  </metadata>
</svg>
