<?xml version="1.0" encoding="UTF-8" standalone="no"?>
<svg
   width="64px"
   height="64px"
   viewBox="0 0 512 512"
   aria-hidden="true"
   role="img"
   class="iconify iconify--fxemoji"
   preserveAspectRatio="xMidYMid meet"
   fill="#000000"
   stroke="#000000"
   version="1.1"
   id="svg18"
   sodipodi:docname="heavy_operation.svg"
   inkscape:version="1.1.2 (0a00cf5339, 2022-02-04, custom)"
   inkscape:export-filename="C:\Users\bened\Desktop\helium\lpclientpc\src\com\lp\client\res\svgs\alarmclock.png"
   inkscape:export-xdpi="24"
   inkscape:export-ydpi="24"
   xmlns:inkscape="http://www.inkscape.org/namespaces/inkscape"
   xmlns:sodipodi="http://sodipodi.sourceforge.net/DTD/sodipodi-0.dtd"
   xmlns="http://www.w3.org/2000/svg"
   xmlns:svg="http://www.w3.org/2000/svg">
  <defs
     id="defs22" />
  <sodipodi:namedview
     id="namedview20"
     pagecolor="#505050"
     bordercolor="#ffffff"
     borderopacity="1"
     inkscape:pageshadow="0"
     inkscape:pageopacity="0"
     inkscape:pagecheckerboard="1"
     showgrid="false"
     inkscape:zoom="6.4921875"
     inkscape:cx="0.53910951"
     inkscape:cy="38.353791"
     inkscape:window-width="1920"
     inkscape:window-height="1017"
     inkscape:window-x="-1928"
     inkscape:window-y="-8"
     inkscape:window-maximized="1"
     inkscape:current-layer="g1318" />
  <g
     id="SVGRepo_bgCarrier"
     stroke-width="0" />
  <g
     id="SVGRepo_iconCarrier">
    <g
       id="g1318"
       transform="matrix(1.1861203,0,0,1.1861203,-47.646797,-71.679373)">
      <rect
         style="fill:#ffffff;fill-opacity:1;stroke:none;stroke-width:10.1967;stroke-linejoin:round;paint-order:markers fill stroke"
         id="rect867"
         width="431.65942"
         height="431.65942"
         x="40.170292"
         y="60.431789" />
      <path
         fill="#FB5046"
         d="m 256,64.394 c -117.011,0 -211.863,94.852 -211.863,211.863 0,117.011 94.852,211.872 211.863,211.872 117.011,0 211.863,-94.861 211.863,-211.872 C 467.863,159.246 373.011,64.394 256,64.394"
         id="path9"
         style="fill:#ff2a2a;stroke:none;fill-opacity:1" />
      <path
         fill="#f9f9f8"
         d="m 83.765,276.261 c 0,94.973 77.267,172.239 172.239,172.239 94.972,0 172.23,-77.267 172.23,-172.239 0,-94.972 -77.258,-172.239 -172.23,-172.239 -94.972,0 -172.239,77.267 -172.239,172.239"
         id="path11"
         style="stroke:none" />
      <path
         fill="#6B8DA1"
         d="m 256,289.451 h 123.172 c 6.11,0 11.071,-4.96 11.071,-11.079 0,-6.11 -4.961,-11.07 -11.071,-11.07 H 256 c -6.119,0 -11.08,4.961 -11.08,11.07 0,6.118 4.961,11.079 11.08,11.079"
         id="path13"
         style="fill:#1a1a1a;stroke:none" />
      <path
         fill="#6B8DA1"
         d="m 256,289.451 c 6.119,0 11.08,-4.96 11.08,-11.079 V 157.844 c 0,-6.119 -4.961,-11.08 -11.08,-11.08 -6.119,0 -11.08,4.961 -11.08,11.08 v 120.527 c 0,6.119 4.961,11.08 11.08,11.08"
         id="path15"
         style="fill:#1a1a1a;stroke:none" />
    </g>
  </g>
</svg>
