<?xml version="1.0" encoding="UTF-8" standalone="no"?>
<!-- Created with Inkscape (http://www.inkscape.org/) -->

<svg
   width="35"
   height="35"
   viewBox="0 0 9.2604163 9.2604167"
   version="1.1"
   id="svg2764"
   inkscape:version="1.1.2 (0a00cf5339, 2022-02-04, custom)"
   sodipodi:docname="document_into.svg"
   xmlns:inkscape="http://www.inkscape.org/namespaces/inkscape"
   xmlns:sodipodi="http://sodipodi.sourceforge.net/DTD/sodipodi-0.dtd"
   xmlns="http://www.w3.org/2000/svg"
   xmlns:svg="http://www.w3.org/2000/svg">
  <sodipodi:namedview
     id="namedview2766"
     pagecolor="#505050"
     bordercolor="#ffffff"
     borderopacity="1"
     inkscape:pageshadow="0"
     inkscape:pageopacity="0"
     inkscape:pagecheckerboard="1"
     inkscape:document-units="mm"
     showgrid="false"
     fit-margin-top="0"
     fit-margin-left="0"
     fit-margin-right="0"
     fit-margin-bottom="0"
     inkscape:zoom="11.844781"
     inkscape:cx="16.589585"
     inkscape:cy="28.535775"
     inkscape:window-width="1920"
     inkscape:window-height="1017"
     inkscape:window-x="-1928"
     inkscape:window-y="-8"
     inkscape:window-maximized="1"
     inkscape:current-layer="g2651"
     units="px" />
  <defs
     id="defs2761" />
  <g
     inkscape:label="Ebene 1"
     inkscape:groupmode="layer"
     id="layer1"
     transform="translate(-203.18,-106.19745)">
    <g
       id="g2651"
       transform="matrix(0.19985711,0,0,0.19985711,192.52585,105.33277)">
      <path
         style="fill:#ffffff;fill-opacity:1;stroke:none;stroke-width:7.55906;stroke-linejoin:round;stroke-opacity:1;paint-order:markers fill stroke"
         d="m 63.476188,4.4937951 h 18.972657 0.0078 0.01953 c 0.32,0 0.592391,0.162484 0.775391,0.396484 l 9.830078,9.8281249 c 0.235,0.183 0.394532,0.455391 0.394532,0.775391 v 0.02148 0.0059 30.972656 c 0,2.209 -1.791,4 -4.000001,4 h -26 c -2.209,0 -4,-1.791 -4,-4 V 8.4938311 c 0,-2.209 1.791,-4 4,-4 z"
         id="path2459" />
      <path
         clip-rule="evenodd"
         d="m 89.476644,50.494404 h -26 c -2.209,0 -4,-1.791 -4,-4 V 8.494405 c 0,-2.209 1.791,-4 4,-4 h 18.973 0.007 0.02 v 0 c 0.32,0 0.593,0.161 0.776,0.395 l 9.829,9.828999 c 0.235,0.183 0.395,0.456 0.395,0.776 v 0 0.021 0.005 30.974 c 0,2.209 -1.791,4 -4,4 z m -6,-42.618999 v 6.618999 h 6.619 z m 8,8.618999 h -9 c -0.553,0 -1,-0.448 -1,-1 V 6.494405 h -18 c -1.104,0 -2,0.896 -2,2 v 37.999999 c 0,1.104 0.896,2 2,2 h 26 c 1.104,0 2,-0.896 2,-2 z"
         fill-rule="evenodd"
         id="path844"
         style="fill:#000000;fill-opacity:1;stroke:none;stroke-opacity:1"
         sodipodi:nodetypes="ssssscccsccscccsscccccsscssssssc" />
      <g
         style="fill:#44aa00;fill-opacity:1;stroke:#000000;stroke-width:0"
         id="g1922"
         transform="matrix(0,1.1214396,-1.1214396,0,87.331744,10.301719)">
        <g
           id="SVGRepo_bgCarrier"
           stroke-width="0"
           style="fill:#44aa00;fill-opacity:1" />
        <g
           id="SVGRepo_iconCarrier"
           style="fill:#44aa00;fill-opacity:1">
          <g
             id="Home"
             style="fill:#44aa00;fill-opacity:1" />
          <g
             id="Print"
             style="fill:#44aa00;fill-opacity:1" />
          <g
             id="Mail"
             style="fill:#44aa00;fill-opacity:1" />
          <g
             id="Camera"
             style="fill:#44aa00;fill-opacity:1" />
          <g
             id="Video"
             style="fill:#44aa00;fill-opacity:1" />
          <g
             id="Film"
             style="fill:#44aa00;fill-opacity:1" />
          <g
             id="Message"
             style="fill:#44aa00;fill-opacity:1" />
          <g
             id="Telephone"
             style="fill:#44aa00;fill-opacity:1" />
          <g
             id="User"
             style="fill:#44aa00;fill-opacity:1" />
          <g
             id="File"
             style="fill:#44aa00;fill-opacity:1" />
          <g
             id="Folder"
             style="fill:#44aa00;fill-opacity:1" />
          <g
             id="Map"
             style="fill:#44aa00;fill-opacity:1" />
          <g
             id="Download"
             style="fill:#44aa00;fill-opacity:1" />
          <g
             id="Upload"
             style="fill:#44aa00;fill-opacity:1">
            <line
               fill="none"
               x1="16"
               x2="16"
               y1="29"
               y2="28"
               id="line16"
               style="fill:#44aa00;fill-opacity:1" />
            <path
               d="m 25.602026,11.7 -8.9,-8.9 c -0.2,-0.2 -0.4,-0.3 -0.7,-0.3 0,0 0,0 0,0 0,0 0,0 0,0 v 0 c -0.3,0 -0.5,0.1 -0.7,0.3 l -9.0000002,9 c -0.3,0.3 -0.4,0.7 -0.2,1.1 0.1,0.4 0.5,0.6 0.9,0.6 h 4.0000002 v 15 c 0,0.5 0.5,1 1,1 h 4 v 0 h 4 v 0 c 0.5,0 1,-0.5 1,-1 v -15 h 4 v 0 c 0.5,0 1,-0.4 1,-1 0,-0.3 -0.2,-0.6 -0.4,-0.8 z"
               fill="#2197f3"
               id="path18"
               inkscape:export-filename="C:\Users\bened\Desktop\helium\lpclientpc\src\com\lp\client\res\svgs\arrow_down_blue.png"
               inkscape:export-xdpi="16"
               inkscape:export-ydpi="16"
               style="fill:#44aa00;fill-opacity:1" />
          </g>
          <g
             id="Video_Recorder"
             style="fill:#44aa00;fill-opacity:1" />
          <g
             id="Schedule"
             style="fill:#44aa00;fill-opacity:1" />
          <g
             id="Cart"
             style="fill:#44aa00;fill-opacity:1" />
          <g
             id="Setting"
             style="fill:#44aa00;fill-opacity:1" />
          <g
             id="Search"
             style="fill:#44aa00;fill-opacity:1" />
          <g
             id="Pencils"
             style="fill:#44aa00;fill-opacity:1" />
          <g
             id="Group"
             style="fill:#44aa00;fill-opacity:1" />
          <g
             id="Record"
             style="fill:#44aa00;fill-opacity:1" />
          <g
             id="Headphone"
             style="fill:#44aa00;fill-opacity:1" />
          <g
             id="Music_Player"
             style="fill:#44aa00;fill-opacity:1" />
          <g
             id="Sound_On"
             style="fill:#44aa00;fill-opacity:1" />
          <g
             id="Sound_Off"
             style="fill:#44aa00;fill-opacity:1" />
          <g
             id="Lock"
             style="fill:#44aa00;fill-opacity:1" />
          <g
             id="Lock_open"
             style="fill:#44aa00;fill-opacity:1" />
          <g
             id="Love"
             style="fill:#44aa00;fill-opacity:1" />
          <g
             id="Favorite"
             style="fill:#44aa00;fill-opacity:1" />
          <g
             id="Film_1_"
             style="fill:#44aa00;fill-opacity:1" />
          <g
             id="Music"
             style="fill:#44aa00;fill-opacity:1" />
          <g
             id="Puzzle"
             style="fill:#44aa00;fill-opacity:1" />
          <g
             id="Turn_Off"
             style="fill:#44aa00;fill-opacity:1" />
          <g
             id="Book"
             style="fill:#44aa00;fill-opacity:1" />
          <g
             id="Save"
             style="fill:#44aa00;fill-opacity:1" />
          <g
             id="Reload"
             style="fill:#44aa00;fill-opacity:1" />
          <g
             id="Trash"
             style="fill:#44aa00;fill-opacity:1" />
          <g
             id="Tag"
             style="fill:#44aa00;fill-opacity:1" />
          <g
             id="Link"
             style="fill:#44aa00;fill-opacity:1" />
          <g
             id="Like"
             style="fill:#44aa00;fill-opacity:1" />
          <g
             id="Bad"
             style="fill:#44aa00;fill-opacity:1" />
          <g
             id="Gallery"
             style="fill:#44aa00;fill-opacity:1" />
          <g
             id="Add"
             style="fill:#44aa00;fill-opacity:1" />
          <g
             id="Close"
             style="fill:#44aa00;fill-opacity:1" />
          <g
             id="Forward"
             style="fill:#44aa00;fill-opacity:1" />
          <g
             id="Back"
             style="fill:#44aa00;fill-opacity:1" />
          <g
             id="Buy"
             style="fill:#44aa00;fill-opacity:1" />
          <g
             id="Mac"
             style="fill:#44aa00;fill-opacity:1" />
          <g
             id="Laptop"
             style="fill:#44aa00;fill-opacity:1" />
        </g>
      </g>
    </g>
  </g>
</svg>
