<?xml version="1.0" encoding="UTF-8" standalone="no"?>
<svg
   height="24"
   viewBox="0 0 24 24"
   width="24"
   version="1.1"
   id="svg4"
   sodipodi:docname="cube_green_preferences.svg"
   inkscape:version="1.1.2 (0a00cf5339, 2022-02-04, custom)"
   inkscape:export-filename="C:\Users\bened\Desktop\helium\lpclientpc\src\com\lp\client\res\original\cube.png"
   inkscape:export-xdpi="64"
   inkscape:export-ydpi="64"
   xmlns:inkscape="http://www.inkscape.org/namespaces/inkscape"
   xmlns:sodipodi="http://sodipodi.sourceforge.net/DTD/sodipodi-0.dtd"
   xmlns="http://www.w3.org/2000/svg"
   xmlns:svg="http://www.w3.org/2000/svg">
  <defs
     id="defs8" />
  <sodipodi:namedview
     id="namedview6"
     pagecolor="#505050"
     bordercolor="#ffffff"
     borderopacity="1"
     inkscape:pageshadow="0"
     inkscape:pageopacity="0"
     inkscape:pagecheckerboard="1"
     showgrid="false"
     inkscape:zoom="17.3125"
     inkscape:cx="24.231047"
     inkscape:cy="9.3574007"
     inkscape:window-width="1920"
     inkscape:window-height="1017"
     inkscape:window-x="-1928"
     inkscape:window-y="-8"
     inkscape:window-maximized="1"
     inkscape:current-layer="g935" />
  <path
     style="fill:#83e700;stroke:none;stroke-width:1.06065;stroke-linejoin:round;stroke-opacity:1;paint-order:markers fill stroke;fill-opacity:1"
     d="M 3.5148018,8.3288778 V 16.615204 L 10.93935,19.913163 V 11.628908 Z"
     id="path1132" />
  <path
     style="fill:#83e700;stroke:none;stroke-width:1.06065;stroke-linejoin:round;stroke-opacity:1;paint-order:markers fill stroke;fill-opacity:1"
     d="M 12,3.6160295 5.0664164,6.6964714 12,9.7769133 13.38796,9.1616536 18.933584,6.6964714 Z"
     id="path1130" />
  <path
     d="M 2.0235281,5.7274522 11.569376,1.484853 a 1.0617104,1.0617104 0 0 1 0.862309,0 l 9.545848,4.2425992 c 0.02121,0.00955 0.03606,0.025456 0.05728,0.037123 0.0297,0.014849 0.06152,0.024395 0.08909,0.042426 0.02333,0.01591 0.04137,0.036062 0.06364,0.053032 a 0.92276533,0.92276533 0 0 1 0.201524,0.2057661 c 0.02121,0.029698 0.04349,0.056214 0.06258,0.085913 a 1.1868671,1.1868671 0 0 1 0.08061,0.1750073 c 0.0095,0.028638 0.02439,0.055154 0.03288,0.083791 a 1.0744382,1.0744382 0 0 1 0.04136,0.2863754 v 10.606498 c 0,0.420017 -0.246071,0.798669 -0.630026,0.969434 l -9.545848,4.242599 C 12.29274,22.576935 12.14637,22.606633 12,22.606633 a 1.0574679,1.0574679 0 0 1 -0.426381,-0.101822 l -0.0042,0.01061 -9.5458479,-4.242599 A 1.0595892,1.0595892 0 0 1 1.3935022,17.303384 V 6.6968861 A 1.0595892,1.0595892 0 0 1 2.0235281,5.7274522 Z M 12,3.6156985 5.0654718,6.6968861 12,9.7780738 13.38733,9.1618363 18.933468,6.6968861 Z M 10.93935,19.913643 V 11.628908 L 3.5148018,8.3292262 v 8.2857958 z"
     id="path2"
     style="fill:#44aa00;stroke:none;stroke-width:1.06065;stroke-opacity:1;fill-opacity:1" />
  <path
     style="fill:#83e700;stroke:none;stroke-width:1.06065;stroke-linejoin:round;stroke-opacity:1;paint-order:markers fill stroke;fill-opacity:1"
     d="m 20.935113,8.3671677 v 8.2863263 l -7.424548,3.297959 v -8.284255 z"
     id="path1132-8" />
  <g
     id="g935"
     transform="matrix(0.63885164,0,0,0.63885164,9.7245915,-648.00775)">
    <g
       style="fill:#000000;stroke:#000000"
       id="g866"
       transform="matrix(1.1835567,0,0,1.1835567,-4.3860116,1028.4628)">
      <g
         id="SVGRepo_bgCarrier-8"
         stroke-width="0" />
      <g
         id="SVGRepo_iconCarrier-0">
        <title
           id="title844">check_fill</title>
        <g
           id="页面-1"
           stroke="none"
           stroke-width="1"
           fill="none"
           fill-rule="evenodd">
          <g
             id="System"
             transform="translate(-192,-48)">
            <g
               id="check_fill"
               transform="translate(192,48)">
              <path
                 d="M 24,0 V 24 H 0 V 0 Z m -11.40651,23.257841 -0.01155,0.0017 -0.07106,0.03553 -0.019,0.0037 v 0 l -0.01516,-0.0037 -0.07106,-0.03553 c -0.0098,-0.0031 -0.01861,-4.89e-4 -0.02351,0.0054 l -0.0041,0.01092 -0.01709,0.427279 0.005,0.02039 0.01101,0.01222 0.103573,0.07398 0.01487,0.0039 v 0 l 0.01177,-0.0039 0.103575,-0.07398 0.0126,-0.01604 v 0 l 0.0034,-0.01656 -0.01709,-0.427279 c -0.002,-0.01013 -0.0085,-0.01653 -0.01607,-0.01799 z m 0.264901,-0.112555 -0.01384,0.002 -0.184705,0.09235 -0.01,0.01024 v 0 l -0.0027,0.01121 0.0179,0.429528 0.0048,0.01278 v 0 l 0.0085,0.0071 0.200954,0.09275 c 0.01209,0.0037 0.02289,-2.52e-4 0.02849,-0.008 l 0.004,-0.01406 -0.03415,-0.614631 c -0.0024,-0.01194 -0.01027,-0.01953 -0.01929,-0.02125 z m -0.715344,0.002 c -0.0098,-0.0049 -0.02087,-0.002 -0.02741,0.0053 l -0.0057,0.01394 -0.03415,0.614631 c -6.39e-4,0.0115 0.007,0.0207 0.01688,0.0234 l 0.01561,-0.0013 0.200955,-0.09275 0.0094,-0.0081 v 0 l 0.0039,-0.0118 0.0179,-0.429528 -0.0032,-0.01259 v 0 l -0.0095,-0.0089 z"
                 id="MingCute"
                 fill-rule="nonzero" />
              <path
                 d="m 21.5456,5.11107 c 0.5858,0.58579 0.5858,1.53553 0,2.12132 L 10.3026,18.4754 c -0.6248,0.6248 -1.63786,0.6248 -2.2627,0 L 2.45376,12.8892 c -0.58579,-0.5857 -0.58579,-1.5355 0,-2.1213 0.58578,-0.5858 1.53553,-0.5858 2.12132,0 L 9.17127,15.3641 19.4243,5.11107 c 0.5858,-0.58579 1.5356,-0.58579 2.1213,0 z"
                 id="路径"
                 fill="#003da7" />
            </g>
          </g>
        </g>
      </g>
    </g>
  </g>
</svg>
