<?xml version="1.0" encoding="UTF-8" standalone="no"?>
<!-- Created with Inkscape (http://www.inkscape.org/) -->

<svg
   width="35"
   height="35"
   viewBox="0 0 9.2604163 9.2604167"
   version="1.1"
   id="svg2764"
   inkscape:version="1.1.2 (0a00cf5339, 2022-02-04, custom)"
   sodipodi:docname="document_attachment_green.svg"
   xmlns:inkscape="http://www.inkscape.org/namespaces/inkscape"
   xmlns:sodipodi="http://sodipodi.sourceforge.net/DTD/sodipodi-0.dtd"
   xmlns="http://www.w3.org/2000/svg"
   xmlns:svg="http://www.w3.org/2000/svg">
  <sodipodi:namedview
     id="namedview2766"
     pagecolor="#505050"
     bordercolor="#ffffff"
     borderopacity="1"
     inkscape:pageshadow="0"
     inkscape:pageopacity="0"
     inkscape:pagecheckerboard="1"
     inkscape:document-units="mm"
     showgrid="false"
     fit-margin-top="0"
     fit-margin-left="0"
     fit-margin-right="0"
     fit-margin-bottom="0"
     inkscape:zoom="16.75105"
     inkscape:cx="8.0890452"
     inkscape:cy="19.282373"
     inkscape:window-width="1920"
     inkscape:window-height="1017"
     inkscape:window-x="-1928"
     inkscape:window-y="-8"
     inkscape:window-maximized="1"
     inkscape:current-layer="layer1-0"
     units="px" />
  <defs
     id="defs2761" />
  <g
     inkscape:label="Ebene 1"
     inkscape:groupmode="layer"
     id="layer1"
     transform="translate(-203.18,-106.19745)">
    <g
       id="g2651"
       transform="matrix(0.19985711,0,0,0.19985711,192.52585,105.33277)">
      <path
         style="fill:#ffffff;fill-opacity:1;stroke:none;stroke-width:7.55906;stroke-linejoin:round;stroke-opacity:1;paint-order:markers fill stroke"
         d="m 63.476188,4.4937951 h 18.972657 0.0078 0.01953 c 0.32,0 0.592391,0.162484 0.775391,0.396484 l 9.830078,9.8281249 c 0.235,0.183 0.394532,0.455391 0.394532,0.775391 v 0.02148 0.0059 30.972656 c 0,2.209 -1.791,4 -4.000001,4 h -26 c -2.209,0 -4,-1.791 -4,-4 V 8.4938311 c 0,-2.209 1.791,-4 4,-4 z"
         id="path2459" />
      <path
         clip-rule="evenodd"
         d="m 89.476644,50.494404 h -26 c -2.209,0 -4,-1.791 -4,-4 V 8.494405 c 0,-2.209 1.791,-4 4,-4 h 18.973 0.007 0.02 v 0 c 0.32,0 0.593,0.161 0.776,0.395 l 9.829,9.828999 c 0.235,0.183 0.395,0.456 0.395,0.776 v 0 0.021 0.005 30.974 c 0,2.209 -1.791,4 -4,4 z m -6,-42.618999 v 6.618999 h 6.619 z m 8,8.618999 h -9 c -0.553,0 -1,-0.448 -1,-1 V 6.494405 h -18 c -1.104,0 -2,0.896 -2,2 v 37.999999 c 0,1.104 0.896,2 2,2 h 26 c 1.104,0 2,-0.896 2,-2 z"
         fill-rule="evenodd"
         id="path844"
         style="fill:#000000;fill-opacity:1;stroke:none;stroke-opacity:1"
         sodipodi:nodetypes="ssssscccsccscccsscccccsscssssssc" />
    </g>
    <g
       id="layer1-0"
       transform="matrix(0.81004292,0,0,0.81004292,205.19524,109.18773)">
      <rect
         style="fill:#d5e5ff;stroke-width:0.254242;stroke-linejoin:round;paint-order:markers fill stroke"
         id="rect982"
         width="6.1018186"
         height="6.1018186"
         x="0.055151545"
         y="0.082727283" />
      <polygon
         points="38,11 41,14 34,21 21,21 6,36 9,39 23,25 36,25 44,17 47,20 47,11 "
         style="fill:#ff0000"
         id="polygon28"
         transform="matrix(0.14384572,0,0,0.14384572,-0.60277242,0.22343337)" />
      <path
         d="M 0.0611678,0.39321112 V 5.8724458 c 0,0.2002702 0.10639845,0.305657 0.30558741,0.305657 1.83388509,-0.00137 3.67155279,0.00241 5.50353949,-0.00116 0.1479936,1.069e-4 0.2821718,-0.1364143 0.2806459,-0.3044799 V 5.5691664 H 0.66996438 V 0.39321112 c 0.001243,-0.40569832 -0.60755714,-0.40621735 -0.60879658,0 z"
         id="path1357"
         style="color:#000000;font-style:normal;font-variant:normal;font-weight:normal;font-stretch:normal;font-size:medium;line-height:normal;font-family:sans-serif;font-variant-ligatures:normal;font-variant-position:normal;font-variant-caps:normal;font-variant-numeric:normal;font-variant-alternates:normal;font-variant-east-asian:normal;font-feature-settings:normal;font-variation-settings:normal;text-indent:0;text-align:start;text-decoration:none;text-decoration-line:none;text-decoration-style:solid;text-decoration-color:#000000;letter-spacing:normal;word-spacing:normal;text-transform:none;writing-mode:lr-tb;direction:ltr;text-orientation:mixed;dominant-baseline:auto;baseline-shift:baseline;text-anchor:start;white-space:normal;shape-padding:0;shape-margin:0;inline-size:0;clip-rule:nonzero;display:inline;overflow:visible;visibility:visible;isolation:auto;mix-blend-mode:normal;color-interpolation:sRGB;color-interpolation-filters:linearRGB;solid-color:#000000;solid-opacity:1;vector-effect:none;fill:#1a1a1a;fill-opacity:1;fill-rule:nonzero;stroke:none;stroke-width:0.608866;stroke-linecap:round;stroke-linejoin:round;stroke-miterlimit:4;stroke-dasharray:none;stroke-dashoffset:0;stroke-opacity:1;color-rendering:auto;image-rendering:auto;shape-rendering:auto;text-rendering:auto;enable-background:accumulate;stop-color:#000000" />
    </g>
  </g>
</svg>
