<?xml version="1.0" encoding="UTF-8" standalone="no"?>
<svg
   viewBox="0 0 32 32"
   version="1.1"
   id="svg15"
   sodipodi:docname="7037902_sea_shipwreck_pirate treasure_pirates_treasure_icon.svg"
   inkscape:version="1.1.2 (0a00cf5339, 2022-02-04, custom)"
   inkscape:export-filename="C:\Users\bened\Desktop\helium\lpclientpc\src\com\lp\client\res\original\7037902_sea_shipwreck_pirate treasure_pirates_treasure_icon.png"
   inkscape:export-xdpi="48"
   inkscape:export-ydpi="48"
   xmlns:inkscape="http://www.inkscape.org/namespaces/inkscape"
   xmlns:sodipodi="http://sodipodi.sourceforge.net/DTD/sodipodi-0.dtd"
   xmlns="http://www.w3.org/2000/svg"
   xmlns:svg="http://www.w3.org/2000/svg">
  <defs
     id="defs19" />
  <sodipodi:namedview
     id="namedview17"
     pagecolor="#505050"
     bordercolor="#ffffff"
     borderopacity="1"
     inkscape:pageshadow="0"
     inkscape:pageopacity="0"
     inkscape:pagecheckerboard="1"
     showgrid="false"
     inkscape:zoom="12.984375"
     inkscape:cx="11.359807"
     inkscape:cy="18.637786"
     inkscape:window-width="1920"
     inkscape:window-height="1017"
     inkscape:window-x="-1928"
     inkscape:window-y="-8"
     inkscape:window-maximized="1"
     inkscape:current-layer="Layer_4" />
  <title
     id="title2" />
  <g
     data-name="Layer 4"
     id="Layer_4">
    <path
       style="fill:#d4aa00;stroke-width:7.55906;stroke-linejoin:round;paint-order:markers fill stroke"
       d="M 10.109375,4.470703 A 7.12,7.12 0 0 0 3,11.589844 V 27.529297 H 29 V 11.589844 A 7.12,7.12 0 0 0 21.890625,4.470703 Z"
       id="path1064" />
    <path
       style="fill:#ffffff;stroke-width:7.55906;stroke-linejoin:round;paint-order:markers fill stroke"
       d="m 14.099609,13.320312 v 0.939454 H 18 v -0.939454 z"
       id="path1068" />
    <path
       style="fill:#808080;stroke-width:7.55906;stroke-linejoin:round;paint-order:markers fill stroke"
       d="M 13.099609,11.320312 H 19 a 1,1 0 0 1 1,1 v 2.939454 a 1,1 0 0 1 -1,1 h -5.900391 a 1,1 0 0 1 -1,-1 v -2.939454 a 1,1 0 0 1 1,-1 z"
       id="path1066" />
    <path
       d="M 29.921776,12.667521 H 2.2617816 a 1.0000001,0.6919375 0 1 1 0,-1.383875 H 29.921776 a 1.0000001,0.6919375 0 0 1 0,1.383875 z"
       id="path6"
       style="stroke-width:0.831828" />
    <path
       d="m 23.532382,29.33 a 0.6534296,1 0 0 1 -0.653429,-1 V 4 a 0.6534296,1 0 0 1 1.306859,0 v 24.33 a 0.6534296,1 0 0 1 -0.65343,1 z"
       id="path8"
       style="stroke-width:0.80835" />
    <path
       d="m 8.5831408,29.302984 a 0.69193742,1 0 0 1 -0.6919374,-1 V 3.9229844 a 0.69193742,1 0 0 1 1.3838748,0 V 28.322984 a 0.69193742,1 0 0 1 -0.6919374,0.98 z"
       id="path10"
       style="stroke-width:0.831828" />
    <path
       d="M 30,29.529297 H 2 a 1,1 0 0 1 -1,-1 v -16.94 a 9.13,9.13 0 0 1 9.11,-9.12 h 11.78 a 9.13,9.13 0 0 1 9.11,9.12 v 16.94 a 1,1 0 0 1 -1,1 z m -27,-2 h 26 v -15.94 a 7.12,7.12 0 0 0 -7.11,-7.12 H 10.11 a 7.12,7.12 0 0 0 -7.11,7.12 z"
       id="path4" />
    <path
       d="m 19,16.259766 h -5.9 a 1,1 0 0 1 -1,-1 v -2.94 a 1,1 0 0 1 1,-1 H 19 a 1,1 0 0 1 1,1 v 2.94 a 1,1 0 0 1 -1,1 z m -4.9,-2 H 18 v -0.94 h -3.9 z"
       id="path12"
       style="fill:#000000" />
    <path
       d="m 9.7027682,15.221721 c -0.256,0 -0.512,-0.097 -0.707,-0.292 -0.195,-0.196 -0.293,-0.452 -0.293,-0.708 v -2.559 c -4.5,-0.498 -8.00000004,-4.3089997 -8.00000004,-8.9409997 v -1 c 2.24500004,3.423 5.25000004,3.92 8.00000004,3.989 v -2.489 c 0,-0.255 0.098,-0.512 0.293,-0.707 0.195,-0.195 0.451,-0.293 0.707,-0.293 0.2560002,0 0.5119998,0.098 0.7069998,0.293 l 6.293,6.207 -6.293,6.2079997 c -0.195,0.195 -0.4509996,0.292 -0.7069998,0.292 z"
       id="path1724"
       style="fill:#44aa00" />
  </g>
</svg>
