<?xml version="1.0" encoding="UTF-8" standalone="no"?>
<!-- Uploaded to: SVG Repo, www.svgrepo.com, Transformed by: SVG Repo Mixer Tools -->

<svg
   fill="#000000"
   height="800px"
   width="800px"
   version="1.1"
   id="Layer_1"
   viewBox="0 0 512 512"
   xml:space="preserve"
   sodipodi:docname="laserpointer.svg"
   inkscape:version="1.1.2 (0a00cf5339, 2022-02-04, custom)"
   xmlns:inkscape="http://www.inkscape.org/namespaces/inkscape"
   xmlns:sodipodi="http://sodipodi.sourceforge.net/DTD/sodipodi-0.dtd"
   xmlns="http://www.w3.org/2000/svg"
   xmlns:svg="http://www.w3.org/2000/svg"><defs
   id="defs23" /><sodipodi:namedview
   id="namedview21"
   pagecolor="#505050"
   bordercolor="#ffffff"
   borderopacity="1"
   inkscape:pageshadow="0"
   inkscape:pageopacity="0"
   inkscape:pagecheckerboard="1"
   showgrid="false"
   inkscape:zoom="0.519375"
   inkscape:cx="181.94946"
   inkscape:cy="427.43682"
   inkscape:window-width="1920"
   inkscape:window-height="1017"
   inkscape:window-x="-1928"
   inkscape:window-y="-8"
   inkscape:window-maximized="1"
   inkscape:current-layer="g921" />


<g
   id="g921"
   transform="rotate(90,255.384,371.2154)"><g
     id="g1013"
     transform="matrix(0.67624461,0,0,0.67624461,14.37213,150.33809)"><g
       id="g6"
       style="fill:#000000">
	<g
   id="g4"
   style="fill:#000000">
		<path
   d="M 494.638,17.347 C 471.516,-5.774 433.886,-5.767 410.754,17.364 L 333.897,94.22 c -0.002,0.003 -0.005,0.005 -0.007,0.007 -0.003,0.003 -0.005,0.005 -0.007,0.007 L 61.317,366.803 c -1.636,1.634 -2.645,3.791 -2.855,6.093 l -6.988,76.879 c -0.265,2.922 0.779,5.811 2.855,7.884 1.86,1.863 4.38,2.896 6.988,2.896 0.297,0 0.596,-0.015 0.895,-0.041 l 76.879,-6.988 c 2.302,-0.21 4.459,-1.219 6.093,-2.855 l 20.958,-20.958 c 0.003,-0.002 0.007,-0.005 0.012,-0.01 0.005,-0.005 0.007,-0.01 0.01,-0.012 L 494.622,101.234 C 505.822,90.033 511.993,75.14 512,59.295 512.005,43.446 505.839,28.549 494.638,17.347 Z m -360.902,416.814 -61.502,5.591 5.591,-61.502 11.45,-11.45 55.911,55.911 z m 25.427,-25.426 -55.911,-55.911 237.627,-237.628 55.914,55.911 z M 480.644,87.255 410.768,157.13 354.857,101.219 424.73,31.344 c 15.429,-15.422 40.516,-15.432 55.931,-0.017 7.464,7.465 11.573,17.395 11.571,27.962 -0.005,10.566 -4.119,20.498 -11.588,27.966 z"
   id="path2"
   style="fill:#000000" />
	</g>
</g><g
       id="g12"
       style="fill:#000000">
	<g
   id="g10"
   style="fill:#000000">
		<path
   d="m 47.338,464.649 c -3.861,-3.861 -10.12,-3.861 -13.977,0 L 2.896,495.116 c -3.861,3.858 -3.861,10.118 0,13.977 1.931,1.93 4.459,2.896 6.989,2.896 2.529,0 5.06,-0.965 6.988,-2.896 l 30.465,-30.468 c 3.861,-3.858 3.861,-10.118 0,-13.976 z"
   id="path8"
   style="fill:#000000" />
	</g>
</g><g
       id="g18"
       style="fill:#000000">
	<g
   id="g16"
   style="fill:#000000">
		<path
   d="m 466.682,45.304 c -3.856,-3.858 -10.12,-3.858 -13.976,0 l -62.902,62.902 c -3.861,3.861 -3.861,10.118 0,13.979 1.928,1.929 4.459,2.894 6.989,2.894 2.529,0 5.06,-0.965 6.988,-2.894 l 62.902,-62.902 c 3.86,-3.861 3.86,-10.118 -10e-4,-13.979 z"
   id="path14"
   style="fill:#000000" />
	</g>
</g><path
       fill="#000000"
       d="m -61.997609,573.61173 52.18023,-37.90622 5.48512,7.56089 -52.17571,37.89823 h 25.06456 v 9.3348 h -25.06491 l 52.17571,37.8982 -5.48825,7.554 -52.17675,-37.8983 7.74401,23.8363 -8.87953,2.8864 -7.74401,-23.837 -19.926914,61.336 -8.883,-2.8864 19.93142,-61.3395 -20.278197,14.734 -5.48164,-7.5351 20.278197,-14.7486 h -64.482657 v -9.3344 h 64.482997 l -20.278187,-14.7486 5.48824,-7.554 20.278197,14.7341 -19.93837,-61.3211 8.87918,-2.88606 19.935254,61.33946 7.74366,-23.837 8.87918,2.8868 z"
       id="path955"
       style="fill:#d40000;stroke-width:0.347467" /><g
       id="g12-2"
       style="fill:#000000"
       transform="translate(-57.155379,62.096507)"><g
         id="g10-9"
         style="fill:#000000"><path
           d="m 47.338,464.649 c -3.861,-3.861 -10.12,-3.861 -13.977,0 L 2.896,495.116 c -3.861,3.858 -3.861,10.118 0,13.977 1.931,1.93 4.459,2.896 6.989,2.896 2.529,0 5.06,-0.965 6.988,-2.896 l 30.465,-30.468 c 3.861,-3.858 3.861,-10.118 0,-13.976 z"
           id="path8-0"
           style="fill:#000000" /></g></g></g></g>
</svg>
