ID |  Title   | Quantity | price
P03  |   Sugar    |   12 |   25.1
P01  |   Miliket    |   10 |   5.2
P02  |   Apple    |   5 |   4.3
P05  |   Rose    |   7 |   15.4
P07  |   Beer    |   11 |   12.2
P04  |   Book    |   9 |   5.2
P06  |   Rice    |   10 |   3.0
