{
  "posts": [
    {
      "id": 1,
      "title": "json-server",
      "author": "typicode"
    }
  ],
  "comments": [
    {
      "id": 1,
      "body": "some comment",
      "postId": 1
    }
  ],
  "profile": {
    "name": "typicode"
  },
  "topic": [
    {
      "id": 1,
      "title": "Photoshop"
    },
    {
      "id": 2,
      "title": "CSS"
    },
    {
      "id": 3,
      "title": "Javascript"
    },
    {
      "id": 4,
      "title": "Python"
    },
    {
      "id": 5,
      "title": "Java"
    },
    {
      "id": 6,
      "title": "Web Design"
    },
    {
      "id": 7,
      "title": "UI/UX"
    },
    {
      "id": 8,
      "title": "Ruby on Rails"
    },
    {
      "id": 9,
      "title": "Data Science"
    }
  ],
  "user_event": [
    {
      "uid": 1,
      "event_id": 19
    },
    {
      "uid": 1,
      "event_id": 0
    },
    {
      "uid": 1,
      "event_id": 3
    }
  ],
  "squad": [
    {
      "id": 0,
      "name": "ManilaCSS",
      "description": "We love CSS",
      "memberCount": 2415
    },
    {
      "id": 2,
      "name": "Codebaes",
      "description": "Best squad ever!",
      "memberCount": 3
    },
    {
      "id": 1,
      "name": "CSSCuties",
      "description": "We really love CSS",
      "memberCount": 5107
    },
    {
      "id": 3,
      "name": "Accenture Manila",
      "description": "Be yourself, make a difference",
      "memberCount": 10428
    },
    {
      "id": 4,
      "name": "Databaes",
      "description": "We love all kinds of databases and we cute OwO",
      "memberCount": 314
    }
  ],
  "event": [
    {
      "id": 0,
      "title": "Develop Her: the All-Female Hackathon",
      "description": "There’s strength in numbers—and Girl Power is stronger in a team! Grab your girls, tap your unique strengths and work together to get more women in technology. Each team must have 3 to 5 members. To come up with solutions that address diverse perspectives, team members can come from different backgrounds, not necessarily tech-related.",
      "location": "Accenture Liquid Studio",
      "date": "September 29, 2018",
      "isFeatured": true,
      "eventUrl": "https://www.accenture.com/ph-en/careers/develop-her",
      "photoUrl": "http://www.accenture.com/t20180822T112259Z__w__/ph-en/_acnmedia/Accenture/Conversion-Assets/Careers/Images/LandingPage/80/Accenture-Develop-Her-marquee2.jpg"
    },
    {
      "id": 1,
      "title": "Ortigas Data Science Meetup",
      "description": "Engineers, entrepreneurs, and technologists interested in talking about how to leverage the impact of data science in the Philippines.",
      "location": "Starbucks Shangri-la",
      "date": "October 27, 2018",
      "isFeatured": true,
      "eventUrl": "https://www.meetup.com/en-AU/Ortigas-Data-Science-Meetup/",
      "photoUrl": "http://www.trainmehub.com/wp-content/uploads/2017/10/stockmarket-750x422.jpg"
    },
    {
      "id": 2,
      "title": "Manila JavaScript #30 - Promise.all() Might!",
      "description":"Our JavaScript Academia brings forth the heroes of the world's favorite language for the causes of peace and justice! Whether you know JavaScript or haven't discovered your Quirk yet, join us for the 3rd year anniversary of Manila JavaScript!",
      "location":"Ecotower",
      "date":"October 18, 2018",
      "isFeatured": true,
      "eventUrl":"https://www.meetup.com/en-AU/ManilaJavaScript/events/254876328/",
      "photoUrl":"https://secure.meetupstatic.com/photos/event/a/b/c/e/highres_474763982.jpeg"
    },
    {
      "id": 3,
      "title": "Women Who Code in the Dark 2018",
      "description":"Ladies, in collaboration with Philippine Web Designer Organization and Manila CSS, we are having our very first Women Who Code in the Dark event.",
      "location":"Atlassian",
      "date":"October 20, 2018",
      "isFeatured": false,
      "eventUrl":"https://codeinthedark.com",
      "photoUrl":"https://secure.meetupstatic.com/photos/event/9/0/d/a/highres_474757082.jpeg"
    },
    {
      "id": 4,
      "title": "SwiftPH Meetup #14 - Open Discussion - Hiring Process of an iOS Developer",
      "description":"Heya! Meetup #14 will be happening this August 18, 2018 at Accenture, Robinsons Cybergate Tower, Pioneer Mandaluyong. Suggested topic was an open discussion about different hiring process or career related talk for iOS developers. If you would like to share your inputs, please join our meetup.",
      "location":"Accenture Philippines (Pioneer)",
      "date":"August 18, 2018",
      "isFeatured": false,
      "eventUrl":"https://www.meetup.com/en-AU/SwiftPH/events/253639147/",
      "photoUrl":"https://secure.meetupstatic.com/photos/event/6/3/4/9/highres_473605417.jpeg"
    },
    {
      "id": 5,
      "title": "WWCodeManila's PHP Web Development Study Group",
      "description":"Heya! Meetup #14 will be happening this August 18, 2018 at Accenture, Robinsons Cybergate Tower, Pioneer Mandaluyong. Suggested topic was an open discussion about different hiring process or career related talk for iOS developers. If you would like to share your inputs, please join our meetup.",
      "location":"Accenture Philippines (Pioneer)",
      "isFeatured": false,      
      "date":"August 18, 2018",
      "eventUrl":"https://www.meetup.com/en-AU/SwiftPH/events/253639147/"
    },
    {
      "id": 6,
      "title": "WWCodeManila's Machine Learning & AI Study Group",
      "description":"Heya! Meetup #14 will be happening this August 18, 2018 at Accenture, Robinsons Cybergate Tower, Pioneer Mandaluyong. Suggested topic was an open discussion about different hiring process or career related talk for iOS developers. If you would like to share your inputs, please join our meetup.",
      "isFeatured": false,      
      "location":"Zendesk",
      "date":"August 18, 2018",
      "eventUrl":"https://www.meetup.com/en-AU/SwiftPH/events/253639147/"
    },
    {
      "id": 7,
      "title": "Humanitarian Applications of Blockchain",
      "description":"Heya! Meetup #14 will be happening this August 18, 2018 at Accenture, Robinsons Cybergate Tower, Pioneer Mandaluyong. Suggested topic was an open discussion about different hiring process or career related talk for iOS developers. If you would like to share your inputs, please join our meetup.",
      "location":"Accenture Philippines (Pioneer)",
      "isFeatured": false,      
      "date":"August 18, 2018",
      "eventUrl":"https://www.meetup.com/en-AU/SwiftPH/events/253639147/"
    },
    {
      "id": 8,
      "title": "Work Jam + Networking",
      "description":"Heya! Meetup #14 will be happening this August 18, 2018 at Accenture, Robinsons Cybergate Tower, Pioneer Mandaluyong. Suggested topic was an open discussion about different hiring process or career related talk for iOS developers. If you would like to share your inputs, please join our meetup.",
      "location":"Accenture Philippines (Pioneer)",
      "isFeatured": false,      
      "date":"August 18, 2018",
      "eventUrl":"https://www.meetup.com/en-AU/SwiftPH/events/253639147/"
    },
    {
      "id": 9,
      "title": "Enter Blockchain - How Entrepreneurs around the World did it",
      "description":"Heya! Meetup #14 will be happening this August 18, 2018 at Accenture, Robinsons Cybergate Tower, Pioneer Mandaluyong. Suggested topic was an open discussion about different hiring process or career related talk for iOS developers. If you would like to share your inputs, please join our meetup.",
      "location":"Accenture Philippines (Pioneer)",
      "isFeatured": false,      
      "date":"August 18, 2018",
      "eventUrl":"https://www.meetup.com/en-AU/SwiftPH/events/253639147/"
    },
    {
      "id": 10,
      "title": "WWCodeManila's Ruby on Rails Study Group - Ruby Fundamentals",
      "description":"Heya! Meetup #14 will be happening this August 18, 2018 at Accenture, Robinsons Cybergate Tower, Pioneer Mandaluyong. Suggested topic was an open discussion about different hiring process or career related talk for iOS developers. If you would like to share your inputs, please join our meetup.",
      "location":"Accenture Philippines (Pioneer)",
      "isFeatured": false,      
      "date":"August 18, 2018",
      "eventUrl":"https://www.meetup.com/en-AU/SwiftPH/events/253639147/"
    },
    {
      "id": 11,
      "title": "WWCodeManila's Python Study Group (Python basics & Flask for beginners)",
      "description":"Heya! Meetup #14 will be happening this August 18, 2018 at Accenture, Robinsons Cybergate Tower, Pioneer Mandaluyong. Suggested topic was an open discussion about different hiring process or career related talk for iOS developers. If you would like to share your inputs, please join our meetup.",
      "location":"Accenture Philippines (Pioneer)",
      "isFeatured": false,      
      "date":"August 18, 2018",
      "eventUrl":"https://www.meetup.com/en-AU/SwiftPH/events/253639147/"
    },
    {
      "id": 12,
      "title": "WWCodeManila's PHP Web Development Study Group",
      "description":"Heya! Meetup #14 will be happening this August 18, 2018 at Accenture, Robinsons Cybergate Tower, Pioneer Mandaluyong. Suggested topic was an open discussion about different hiring process or career related talk for iOS developers. If you would like to share your inputs, please join our meetup.",
      "location":"Accenture Philippines (Pioneer)",
      "isFeatured": false,      
      "date":"August 18, 2018",
      "eventUrl":"https://www.meetup.com/en-AU/SwiftPH/events/253639147/"
    },
    {
      "id": 13,
      "title": "WWCodeManila's Python Study Group (Python basics & Flask for beginners)",
      "description":"Heya! Meetup #14 will be happening this August 18, 2018 at Accenture, Robinsons Cybergate Tower, Pioneer Mandaluyong. Suggested topic was an open discussion about different hiring process or career related talk for iOS developers. If you would like to share your inputs, please join our meetup.",
      "location":"Accenture Philippines (Pioneer)",
      "isFeatured": false,      
      "date":"August 18, 2018",
      "eventUrl":"https://www.meetup.com/en-AU/SwiftPH/events/253639147/"
    },
    {
      "id": 14,
      "title": "WWCodeManila's Data Science with R Study Group",
      "description":"Heya! Meetup #14 will be happening this August 18, 2018 at Accenture, Robinsons Cybergate Tower, Pioneer Mandaluyong. Suggested topic was an open discussion about different hiring process or career related talk for iOS developers. If you would like to share your inputs, please join our meetup.",
      "isFeatured": false,      
      "location":"Zendesk",
      "date":"August 18, 2018",
      "eventUrl":"https://www.meetup.com/en-AU/SwiftPH/events/253639147/"
    },
    {
      "id": 15,
      "title": "WWCodeManila's JavaScript Study Group (in Quezon City)",
      "description":"Heya! Meetup #14 will be happening this August 18, 2018 at Accenture, Robinsons Cybergate Tower, Pioneer Mandaluyong. Suggested topic was an open discussion about different hiring process or career related talk for iOS developers. If you would like to share your inputs, please join our meetup.",
      "location":"Happy Hive Co-working space",
      "isFeatured": false,      
      "date":"August 18, 2018",
      "eventUrl":"https://www.meetup.com/en-AU/SwiftPH/events/253639147/"
    },
    {
      "id": 16,
      "title": "WWCodeManila's Ruby on Rails Study Group (in Quezon City)",
      "description":"Heya! Meetup #14 will be happening this August 18, 2018 at Accenture, Robinsons Cybergate Tower, Pioneer Mandaluyong. Suggested topic was an open discussion about different hiring process or career related talk for iOS developers. If you would like to share your inputs, please join our meetup.",
      "isFeatured": false,      
      "location":"UP Diliman",
      "date":"August 18, 2018",
      "eventUrl":"https://www.meetup.com/en-AU/SwiftPH/events/253639147/"
    },
    {
      "id": 17,
      "title": "WWCodeManila's ReactJS Study Group (in Quezon City)",
      "description":"Heya! Meetup #14 will be happening this August 18, 2018 at Accenture, Robinsons Cybergate Tower, Pioneer Mandaluyong. Suggested topic was an open discussion about different hiring process or career related talk for iOS developers. If you would like to share your inputs, please join our meetup.",
      "location":"Mayaman, Diliman",
      "isFeatured": false,      
      "date":"August 18, 2018",
      "eventUrl":"https://www.meetup.com/en-AU/SwiftPH/events/253639147/"
    },
    {
      "id": 18,
      "title": "WWCodeManila's HTML & CSS Study Group (in Quezon City)",
      "description":"Heya! Meetup #14 will be happening this August 18, 2018 at Accenture, Robinsons Cybergate Tower, Pioneer Mandaluyong. Suggested topic was an open discussion about different hiring process or career related talk for iOS developers. If you would like to share your inputs, please join our meetup.",
      "location":"Mayaman, Diliman",
      "date":"August 18, 2018",
      "isFeatured": false,      
      "eventUrl":"https://www.meetup.com/en-AU/SwiftPH/events/253639147/"
    },
    {
      "id": 19,
      "title": "Program the Future",
      "description": "Program the Future is an annual competition that challenges university students to create innovative technology solutions that can improve the way we were work and live.",
      "location":"Mayaman, Diliman",
      "date":"August 18, 2018",
      "isFeatured": false,
      "photoUrl": "https://www.accenture.com/t20180504T122658Zw1196/ph-en/_acnmedia/Accenture/Conversion-Assets/Careers/Images/LandingPage/78/Accenture-PTF-2018-marquee1.png",
      "eventUrl":"https://www.meetup.com/en-AU/SwiftPH/events/253639147/"
    }
  ],
  "user": [
    {
      "id": 1,
      "name": "Michie Ang",
      "description": "Pellentesque ante quam, congue quis metus ac, ullamcorper gravida elit. Fusce quis enim enim. Vivamus efficitur posuere urna vitae dignissim. Ut amet.",
      "position": "Director of Women Who Code",
      "isFeatured": true,
      "photoUrl": "https://media.licdn.com/dms/image/C5603AQHVnytyKeAPaA/profile-displayphoto-shrink_800_800/0?e=1543449600&v=beta&t=YcheFj250mePhFk4L_yDxTEDOWL2VWR1Rnzh4eU5A1k"
    },
    {
      "id": 2,
      "name": "Chaye Cabal-Revilla",
      "description": "Nullam pretium faucibus felis et malesuada. Maecenas diam tortor, feugiat non arcu eu, convallis molestie ipsum. Duis metus tellus, mattis mollis sed.",
      "position": "Chief Financial Officer of Smart Communications, Inc.",
      "isFeatured": true,
      "photoUrl": "https://pldthome.com/images/default-source/default-album/annual-report-pix-of-ms-chaye-1.jpg?sfvrsn=d6d17613_0"
    },
    {
      "id": 3,
      "name": "Louise Sabariaga",
      "description": "Nam cursus turpis quis dui pulvinar, eget imperdiet mauris convallis. Ut lorem ex, viverra eget vulputate non, fringilla vitae erat. Fusce magna amet. ",
      "position": "Managing Director at Accenture",
      "isFeatured": true,
      "photoUrl": "https://media.licdn.com/dms/image/C4D03AQFyFTcUpHgWJw/profile-displayphoto-shrink_800_800/0?e=1543449600&v=beta&t=CfvSegbygCtpdqgQTS9m9TduGguCplDX1p5Tyi9t4xw"
    },
    {
      "id": 4,
      "name": "Althene Marie Francisco",
      "description": "Vestibulum rhoncus elementum dui, id laoreet velit facilisis pretium. Orci varius natoque penatibus et magnis dis parturient montes, nascetur posuere.",
      "position": "Director of Operations at Sitel",
      "isFeatured": true,
      "photoUrl": "https://media.licdn.com/dms/image/C5603AQGUPtOQujwlsw/profile-displayphoto-shrink_800_800/0?e=1543449600&v=beta&t=8xb9ho0AIvHUxzkcDNuacSGPwLaYlcPCTeGcqWvqnQU"
    },
    {
      "id": 5,
      "name": "Alexandra Nadya Cao",
      "description": " Nullam mi metus, maximus sed finibus vel, auctor nec mauris. Curabitur auctor lorem quis felis accumsan, sit amet consequat sem tincidunt. In a metus.",
      "position": "Agile Project Manager at Accenture",
      "isFeatured": true,
      "photoUrl": "https://media.licdn.com/dms/image/C4E03AQEVznaMsbeq2g/profile-displayphoto-shrink_800_800/0?e=1543449600&v=beta&t=xRj5DERx1_jU_mzhnl4_eSy3M16Rht8njkM7JmZ8Pls"
    },
    {
      "id": 6,
      "name": "Kaira del Rosario",
      "description": "Leverage agile frameworks to provide a robust synopsis for high level overviews. Iterative approaches to corporate strategy foster collaborative thinking to further the overall value proposition. Organically grow the holistic world view of disruptive innovation via workplace diversity and empowerment.",
      "position": "Junior Web Developer at Tanda",
      "isFeatured": false,
      "photoUrl": "/assets/images/profile_pic2.png"
    }
  ]
}
