$date
  Wed Oct 23 14:28:31 2019
$end
$version
  GHDL v0
$end
$timescale
  1 fs
$end
$scope module standard $end
$upscope $end
$scope module std_logic_1164 $end
$upscope $end
$scope module numeric_std $end
$upscope $end
$scope module test $end
$var reg 1 ! i2 $end
$var reg 1 " i1 $end
$var reg 1 # i0 $end
$var reg 1 $ s $end
$var reg 1 % r $end
$scope module fdd_full_adder $end
$var reg 1 & a $end
$var reg 1 ' b $end
$var reg 1 ( c $end
$var reg 1 ) s $end
$var reg 1 * r $end
$var reg 2 + resultat[1:0] $end
$upscope $end
$upscope $end
$enddefinitions $end
#0
0!
0"
0#
0$
0%
0&
0'
0(
0)
0*
b00 +
#10000000
1#
1$
1(
1)
b01 +
#20000000
1!
1"
0#
0$
1%
1&
1'
0(
0)
1*
b10 +
#30000000
0!
1#
0&
1(
