   1              	# 1 "src/tp4exo1.s"
   1              	.global _start
   0              	
   0              	
   2              	
   3              	.equ PIOB_BASE, 0xFFFFF600
   4              	.equ PIO_PER, 0
   5              	.equ PIO_OER, 0x10
   6              	.equ PIO_ODR, 0x14
   7              	.equ PIO_SODR, 0x30
   8              	.equ PIO_CODR, 0x34
   9              	.equ PIO_PDSR, 0x3C
  10              	.EQU LED1, 1<<27
  11              	.EQU LED2, 1<<28
  12              	.EQU LED3, 1<<29
  13              	.EQU LED4, 1<<30
  14              	.EQU LEDS, LED1|LED2|LED3|LED4
  15              	.EQU SW1, 1<<24
  16              	.EQU SW2, 1<<25
  17              	.EQU BOUTONS, SW1|SW2
  18              	
  19              	_start:
  20 0000 0D0000EB 	bl init
  21 0004 54C09FE5 	ldr r12,=PIOB_BASE
  22 0008 0213A0E3 	mov r1,#LED1
  23              	while1:
  24 000c 0266A0E3 	mov r6, #0x200000
  25 0010 3C209CE5 	ldr r2,[r12,#PIO_PDSR]
  26 0014 010412E3 	tst r2, #SW1
  27 0018 0600000A 	beq _exit
  28 001c 020312E3 	tst r2,#LED1
  29 0020 30108C05 	streq r1,[r12,#PIO_SODR] @ allume
  30 0024 34108C15 	strne r1,[r12,#PIO_CODR] @ eteint
  31 0028 000056E3 	while2:cmp r6, #0x0
  32 002c 01604612 	        subne r6, r6, #1
  33 0030 FCFFFF1A 	        bne while2
  34 0034 F4FFFFEA 	b while1
  35              	
  36              	_exit:
  37 0038 FEFFFFEA 	b _exit
  38              	
  39              	
  40              	init:
  41 003c 00502DE9 	stmfd sp!,{r12,lr}
  42 0040 18C09FE5 	ldr r12,=PIOB_BASE
  43 0044 09E4A0E3 	mov lr,#LED1|SW1
  44 0048 00E08CE5 	str lr,[r12,#PIO_PER] @ activer broches 24 et 27
  45 004c 02E3A0E3 	mov lr,#LED1
  46 0050 10E08CE5 	str lr,[r12,#PIO_OER] @ LED est une sortie
  47 0054 01E4A0E3 	mov lr,#SW1
  48 0058 14E08CE5 	str lr,[r12,#PIO_ODR] @ BOUTON est une entrée
  49 005c 0090BDE8 	ldmfd sp!,{r12,pc}
  49      00F6FFFF 
DEFINED SYMBOLS
       src/tp4exo1.s:19     .text:0000000000000000 _start
       src/tp4exo1.s:3      *ABS*:00000000fffff600 PIOB_BASE
       src/tp4exo1.s:4      *ABS*:0000000000000000 PIO_PER
       src/tp4exo1.s:5      *ABS*:0000000000000010 PIO_OER
       src/tp4exo1.s:6      *ABS*:0000000000000014 PIO_ODR
       src/tp4exo1.s:7      *ABS*:0000000000000030 PIO_SODR
       src/tp4exo1.s:8      *ABS*:0000000000000034 PIO_CODR
       src/tp4exo1.s:9      *ABS*:000000000000003c PIO_PDSR
       src/tp4exo1.s:10     *ABS*:0000000008000000 LED1
       src/tp4exo1.s:11     *ABS*:0000000010000000 LED2
       src/tp4exo1.s:12     *ABS*:0000000020000000 LED3
       src/tp4exo1.s:13     *ABS*:0000000040000000 LED4
       src/tp4exo1.s:14     *ABS*:0000000078000000 LEDS
       src/tp4exo1.s:15     *ABS*:0000000001000000 SW1
       src/tp4exo1.s:16     *ABS*:0000000002000000 SW2
       src/tp4exo1.s:17     *ABS*:0000000003000000 BOUTONS
       src/tp4exo1.s:40     .text:000000000000003c init
       src/tp4exo1.s:20     .text:0000000000000000 $a
       src/tp4exo1.s:23     .text:000000000000000c while1
       src/tp4exo1.s:36     .text:0000000000000038 _exit
       src/tp4exo1.s:31     .text:0000000000000028 while2
       src/tp4exo1.s:49     .text:0000000000000060 $d

NO UNDEFINED SYMBOLS
