module go_5_server

go 1.16

require (
	go.opentelemetry.io/contrib/instrumentation/net/http/otelhttp v0.21.0
	go.opentelemetry.io/otel v1.0.0-RC1
	go.opentelemetry.io/otel/exporters/trace/jaeger v1.0.0-RC1
	go.opentelemetry.io/otel/sdk v1.0.0-RC1
	go.opentelemetry.io/otel/trace v1.0.0-RC1
)
