{
  "versions": [
    {
      "git-tree": "a1f9f32c2e0778573a20d4b59fda9be37cf6134d",
      "version": "7.6.0",
      "port-version": 0
    },
    {
      "git-tree": "1afbbcf0d6d85963a334b8ae8e95b4fe16a9ff5b",
      "version-string": "7.5.0",
      "port-version": 1
    },
    {
      "git-tree": "0d003408ab69f77a4ca2c02de115087c87a46b27",
      "version-string": "7.5.0",
      "port-version": 0
    },
    {
      "git-tree": "dc198546c1a39fc3a26f7fae34f1ca97afa94f32",
      "version-string": "7.4.0",
      "port-version": 3
    },
    {
      "git-tree": "646db5b2c13e7a7a45048373edc27efcfd348dd9",
      "version-string": "7.4.0",
      "port-version": 2
    },
    {
      "git-tree": "9735f1411a8eb5954d588eb13162b3b07f35726e",
      "version-string": "7.4.0",
      "port-version": 1
    },
    {
      "git-tree": "4ffd2ac8cc350cd08652297a4959d172c1d45d6a",
      "version-string": "7.4.0",
      "port-version": 0
    }
  ]
}
