{
    "version": "8.0.9",
    "release_date": "2025-02-19",
    "details_url": "https://www.kicad.org/blog/2025/02/KiCad-8.0.9-Release/",
    "downloads": [
        {
            "os": "windows",
            "arch": "amd64",
            "filename": "kicad-8.0.9-x86_64.exe",
            "mirrors": [
                {
                    "key": "github",
                    "path": "https://github.com/KiCad/kicad-source-mirror/releases/download/8.0.9/kicad-8.0.9-x86_64.exe"
                }
            ],
            "checksums": [
                {
                    "type": "sha256",
                    "value": "059771acc618db0c0bacd246ebd39500e683c88858aab5e5f8265a8f7e2080d9"
                }
            ]
        },
        {
            "os": "windows",
            "arch": "arm64",
            "filename": "kicad-8.0.9-arm64.exe",
            "mirrors": [
                {
                    "key": "github",
                    "path": "https://github.com/KiCad/kicad-source-mirror/releases/download/8.0.9/kicad-8.0.9-arm64.exe"
                }
            ],
            "checksums": [
                {
                    "type": "sha256",
                    "value": "6b63fd123c382d9f8dbcc49d576c2f4828a15a2d57a7a41448e1bee7008e2bb5"
                }
            ]
        },
        {
            "os": "macos",
            "arch": "unified",
            "filename": "kicad-unified-universal-8.0.9.dmg",
            "mirrors": [
                {
                    "key": "github",
                    "path": "https://github.com/KiCad/kicad-source-mirror/releases/download/8.0.9/kicad-unified-universal-8.0.9.dmg"
                }
            ],
            "checksums": [
                {
                    "type": "sha256",
                    "value": "865a96ff02e9dc4d5e6d3554d8224b7d780aae7b2975329d911dfe57820ba07a"
                }
            ]
        }
    ]
}
