{
    "version": "8.0.0",
    "release_date": "2024-02-23",
    "details_url": "https://www.kicad.org/blog/2024/02/Version-8.0.0-Released/",
    "downloads": [
        {
            "os": "windows",
            "arch": "amd64",
            "filename": "kicad-8.0.0-x86_64.exe",
            "mirrors": [
                {
                    "key": "github",
                    "path": "https://github.com/KiCad/kicad-source-mirror/releases/download/8.0.0/kicad-8.0.0-x86_64.exe"
                }
            ],
            "checksums": [
                {
                    "type": "sha256",
                    "value": "af1a058f15e165fac684478a1c14aea78bed636fe07d708e2a1b9467d0b9754c"
                }
            ]
        },
        {
            "os": "windows",
            "arch": "arm64",
            "filename": "kicad-8.0.0-arm64.exe",
            "mirrors": [
                {
                    "key": "github",
                    "path": "https://github.com/KiCad/kicad-source-mirror/releases/download/8.0.0/kicad-8.0.0-arm64.exe"
                }
            ],
            "checksums": [
                {
                    "type": "sha256",
                    "value": "dd6309caa61f9828d1de66343625bdced8692bbfb003477c556c1b70f33cd55b"
                }
            ]
        },
        {
            "os": "macos",
            "arch": "unified",
            "filename": "kicad-unified-universal-8.0.0.dmg",
            "mirrors": [
                {
                    "key": "github",
                    "path": "https://github.com/KiCad/kicad-source-mirror/releases/download/8.0.0/kicad-unified-universal-8.0.0.dmg"
                }
            ],
            "checksums": [
                {
                    "type": "sha256",
                    "value": "d805176aa060fa024cf952a01c1c3ed0b3dd6f435b5c4817157deaccc5482a06"
                }
            ]
        }
    ]
}