{
    "windows": {
        "name": "Windows",
        "icon": "fa-windows",
        "architectures": {
            "i686": {
                "name": "32-bit"
            },
            "x86-64": {
                "name": "64-bit"
            },
            "arm64": {
                "name": "ARM64"
            }
        },
        "explore": {
            "nightlies": {
                "prefix": "windows/nightly/",
                "title": "Nightlies",
                "description": "Builds of the KiCad source code on a daily basis. These are intended for willing testers but bugs are to be expected.",
                "mirror": "r2"
            },
            "8.0-testing": {
                "prefix": "windows/testing/8.0/",
                "title": "8.0 Testing",
                "description": "Builds of updated 8.0 source code, these may contain bug fixes the stable releases do not yet.",
                "mirror": "chcern"
            },
            "9.0-testing": {
                "prefix": "windows/testing/9.0/",
                "title": "9.0 Testing",
                "description": "Builds of updated 9.0 source code, these may contain bug fixes the stable releases do not yet.",
                "mirror": "chcern"
            },
            "stable": {
                "prefix": "windows/stable/",
                "title": "All Stable Releases",
                "description": "Builds of all of KiCad's previous stable releases beginning with 4.0.",
                "mirror": "chcern"
            }
        }
    },
    "macos": {
        "name": "macOS",
        "icon": "fa-apple",
        "architectures": {
            "unified": {
                "name": "Unified"
            }
        },
        "explore": {
            "nightlies": {
                "prefix": "osx/nightly/",
                "title": "Nightlies",
                "description": "Builds of the KiCad source code on a daily basis. These are intended for willing testers but bugs are to be expected.",
                "mirror": "chcern"
            },
            "8.0-testing": {
                "prefix": "osx/testing/8.0/",
                "title": "8.0 Testing",
                "description": "Builds of updated 8.0 source code, these may contain bug fixes the stable releases do not yet.",
                "mirror": "chcern"
            },
            "9.0-testing": {
                "prefix": "osx/testing/9.0/",
                "title": "9.0 Testing",
                "description": "Builds of updated 9.0 source code, these may contain bug fixes the stable releases do not yet.",
                "mirror": "chcern"
            },
            "stable": {
                "prefix": "osx/stable/",
                "title": "All Stable Releases",
                "description": "Builds of all of KiCad's previous stable releases beginning with 4.0.",
                "mirror": "chcern"
            }
        }
    }
}
