{
    "version": "8.0.5",
    "release_date": "2024-09-07",
    "details_url": "https://www.kicad.org/blog/2024/09/KiCad-8.0.5-Release/",
    "downloads": [
        {
            "os": "windows",
            "arch": "amd64",
            "filename": "kicad-8.0.5-x86_64.exe",
            "mirrors": [
                {
                    "key": "github",
                    "path": "https://github.com/KiCad/kicad-source-mirror/releases/download/8.0.5/kicad-8.0.5-x86_64.exe"
                }
            ],
            "checksums": [
                {
                    "type": "sha256",
                    "value": "aeb417c70da6217ddb845a7d848e3abf8b9a0fb11104b389a177a5e638826035"
                }
            ]
        },
        {
            "os": "windows",
            "arch": "arm64",
            "filename": "kicad-8.0.5-arm64.exe",
            "mirrors": [
                {
                    "key": "github",
                    "path": "https://github.com/KiCad/kicad-source-mirror/releases/download/8.0.5/kicad-8.0.5-arm64.exe"
                }
            ],
            "checksums": [
                {
                    "type": "sha256",
                    "value": "fd1c60f019ece498bef7ab9c63539c7037871c58ae10af77b20b243525b5dc5b"
                }
            ]
        },
        {
            "os": "macos",
            "arch": "unified",
            "filename": "kicad-unified-universal-8.0.5.dmg",
            "mirrors": [
                {
                    "key": "github",
                    "path": "https://github.com/KiCad/kicad-source-mirror/releases/download/8.0.5/kicad-unified-universal-8.0.5.dmg"
                }
            ],
            "checksums": [
                {
                    "type": "sha256",
                    "value": "3002f00be89c09051857309d5bc5f2ed28ab6004d5f48b7f266793afeafdf6cd"
                }
            ]
        }
    ]
}