{
    "version": "8.0.4",
    "release_date": "2024-07-18",
    "details_url": "https://www.kicad.org/blog/2024/07/KiCad-8.0.4-Release/",
    "downloads": [
        {
            "os": "windows",
            "arch": "amd64",
            "filename": "kicad-8.0.4-x86_64.exe",
            "mirrors": [
                {
                    "key": "github",
                    "path": "https://github.com/KiCad/kicad-source-mirror/releases/download/8.0.4/kicad-8.0.4-x86_64.exe"
                }
            ],
            "checksums": [
                {
                    "type": "sha256",
                    "value": "75bdfc49bbe582cb861662b448388efb8ecf6583a48c8da23b3125ad44de65ff"
                }
            ]
        },
        {
            "os": "windows",
            "arch": "arm64",
            "filename": "kicad-8.0.4-arm64.exe",
            "mirrors": [
                {
                    "key": "github",
                    "path": "https://github.com/KiCad/kicad-source-mirror/releases/download/8.0.4/kicad-8.0.4-arm64.exe"
                }
            ],
            "checksums": [
                {
                    "type": "sha256",
                    "value": "5c536337e57472299b99f09187dfd7644a45edcd1fba6b3d450ade2bf7b04cb0"
                }
            ]
        },
        {
            "os": "macos",
            "arch": "unified",
            "filename": "kicad-unified-universal-8.0.4.dmg",
            "mirrors": [
                {
                    "key": "github",
                    "path": "https://github.com/KiCad/kicad-source-mirror/releases/download/8.0.4/kicad-unified-universal-8.0.4.dmg"
                }
            ],
            "checksums": [
                {
                    "type": "sha256",
                    "value": "30bbb7771d8e279f625d08632c02636e79f15f67006ae6e0cb5828fc698821e8"
                }
            ]
        }
    ]
}