<?xml version="1.0" encoding="UTF-8" standalone="no"?>
<!-- Created with Inkscape (http://www.inkscape.org/) -->

<svg
   version="1.1"
   id="svg1"
   width="899"
   height="469"
   viewBox="0 0 899 469"
   sodipodi:docname="courtyard-outline.svg"
   inkscape:version="1.4 (e7c3feb100, 2024-10-09)"
   inkscape:export-filename="../src/getting_started_in_kicad/images/courtyard-outline.png"
   inkscape:export-xdpi="96"
   inkscape:export-ydpi="96"
   xmlns:inkscape="http://www.inkscape.org/namespaces/inkscape"
   xmlns:sodipodi="http://sodipodi.sourceforge.net/DTD/sodipodi-0.dtd"
   xmlns:xlink="http://www.w3.org/1999/xlink"
   xmlns="http://www.w3.org/2000/svg"
   xmlns:svg="http://www.w3.org/2000/svg">
  <defs
     id="defs1">
    <rect
       x="596.76929"
       y="32.80901"
       width="179.11945"
       height="39.016117"
       id="rect1-78" />
    <rect
       x="596.76929"
       y="32.80901"
       width="219.76991"
       height="43.597736"
       id="rect1-5" />
    <rect
       x="596.76929"
       y="32.80901"
       width="179.11945"
       height="39.016117"
       id="rect1-7" />
    <rect
       x="596.76929"
       y="32.80901"
       width="179.11945"
       height="39.016117"
       id="rect1" />
  </defs>
  <sodipodi:namedview
     id="namedview1"
     pagecolor="#ffffff"
     bordercolor="#111111"
     borderopacity="1"
     inkscape:showpageshadow="0"
     inkscape:pageopacity="0"
     inkscape:pagecheckerboard="1"
     inkscape:deskcolor="#d1d1d1"
     inkscape:zoom="1.0563652"
     inkscape:cx="488.46741"
     inkscape:cy="256.06674"
     inkscape:window-width="2560"
     inkscape:window-height="1372"
     inkscape:window-x="0"
     inkscape:window-y="0"
     inkscape:window-maximized="1"
     inkscape:current-layer="g1" />
  <g
     inkscape:groupmode="layer"
     inkscape:label="Image"
     id="g1">
    <image
       width="899"
       height="469"
       preserveAspectRatio="none"
       xlink:href="data:image/png;base64,iVBORw0KGgoAAAANSUhEUgAAA4MAAAHVCAYAAABL3y45AAAACXBIWXMAAA7EAAAOxAGVKw4bAAAA&#10;DXRFWHRsb2dpY2FsWAAxMDA1klgiEAAAAAx0RVh0bG9naWNhbFkAMzgxBPy8nwAAAChpVFh0c3Vi&#10;R2VvbWV0cnlMaXN0AAAAVVRGLTgAc3ViR2VvbWV0cnlMaXN0ANzG6VIAACAASURBVHhe7d1/mB3V&#10;fef5T+t3IyQLIWRjBRulsemg9sQRyQIOiMjMKPvEGSQZgoR/4G2NJjNAYhZtP6tR1iJ5kHZYZTUQ&#10;OwNkEllKbAckByyJPCRBO1iDIAF2gpJ4G6exrQiCcTyyELYUaLV+9f5xXbfvPfdU1am6VefWrXq/&#10;nqefvrduVX3r1O9vnVNVPZrTNy4AACrowBM7tOTGQbMzAACVMMnsAAAAAAAoP5JBAAAAAKggkkEA&#10;AAAAqKDYZHDzkL97KXzGkvzG8xlLKm+8zUOD9T9fyhpL8hvPZyyp3PF8xpL8xvMZqxN8ls9nLMlv&#10;PJ+xJL/xfMaSyh3Pd6zgzwdfcQJljuczluQ3nkusHh4gAwCoKh4gAwCostiaQQAAAABA+ZAMAgAA&#10;AEAFkQwCAAAAQAWRDAIAAABABZEMAgAAAEAFkQwCAAAAQAWRDAIAAABABZEMAgAAAEAFkQwCAAAA&#10;QAWRDAIAAABABZEMAgAAAEAFkQwCAAAAQAWRDAIAAABABZEMAgAAAEAFkQwCAAAAQAWRDAIAAABA&#10;BZEMAgAAAEAFkQwCAAAAQAWRDAIAAABABZEMAgAAAEAFkQwCAAAAQAWRDAIAAABABZEMAgAAAEAF&#10;kQwCAAAAQAX1aE7fuNkRAGA3Pn+/2QlAgfQcWWp2AgCEmGJ2AABE42SzPA48sUNLbhw0O6NLcbEG&#10;AJKJbSa6ecjfQdJnLMlvPJ+xpPLG2zw0WP/zpayxJL/xfMaSyh3PZyzJbzyfsTrBZ/l8xpL8xvMZ&#10;S/Ibz2csqdzxfMcK/nzwFSdQ5ng+Y0l+47nEopkoACQwPn9/vWbwyUdu03VXXdrcAwCvnn3xVX3s&#10;E1+S1Lx9AgDixdYMAgDsSASBzmM7BID0SAYBAAAAoIJ4gAwAZODzv/8DDfT3mZ0B5GB45JDu+tWL&#10;zM4AgISoGQSADJAIAv6wvQFANkgGAQAAAKCCaCYKABlbOThkdkJB8Z7B7rJ7x1azEwCgDdQMAgAA&#10;AEAFkQwCAAAAQAWRDAIAAABABZEMAgAAAEAFkQwCAAAAQAWRDAIAAABABZEMAgAAAEAFkQwCAAAA&#10;QAWRDAIAAABABZEMAgAAAEAFkQwCAAAAQAWRDAIAAABABZEMAgAAAEAFkQwCAAAAQAWRDAIAAABA&#10;BZEMAgAAAEAFkQwCAAAAQAVNMTsAAGB68pHbdN1Vl5qdIz374qt67oXXdN8XnjF/ipUmXuDZF1/V&#10;xz7xJbNziycfuU0fXnRYxw/dY/4UyzVGo6BMaYYNk8c4AQDVQc0gACBWmsTsuqsu1Ya7rtfxQ/do&#10;w2evN3+OlCZewHVY1/5s0gwbDJNm2DB5jBMAUB2xyeDmoUGzU258xpL8xvMZSypvvM1Dg/U/X8oa&#10;S/Ibz2csyX88n3yXLYt4G+66Xtde9X6zc4ssYj374qtmp8z5iNGuLOZlEr7j+eSzbD5jSeWO5ztW&#10;8OeDrziBMsfzGUvyG88lVo/m9I2bHQEAduPz96vnyFJJampe+PSB2fXPKweH6p/LorGss/vubfgl&#10;3IbPXq9rr35/vdYqSVPGNPGS8hGjUR7x8hhnke3esbX++YYlx+ufg7I3bp8AgHixNYMAAKRx3xee&#10;0X2ff6b+/bqrLnWqHexmTz5ym44fuqfeNDauvBs+e319mCcfuc38WVI+4wQAQOIBMgCAHD334mt6&#10;9sVX67WDG+663rl2sBs13ru34a7rtUG1eyUbk2LJ/oAc83sgj3ECACBRMwgAyJlZO1hmZoIW2HBX&#10;8wN0bPMh7D7EPMYJAIBEzSAAIGfPvfia2am07vvCM7rvC8/o2qtq90qaCZvJ5fUbeYwTAACJZBAA&#10;gMw99+Jreu7FWkJ27VXv15898pmm35M8TCcQN06pGg+RAQBkh2aiAADkyFaT1+7DdGzjlGr3DQIA&#10;4IpkEACAnARNOwON9/CFJXRxzHGa92S2k2QCAKqFZBAAkKsNn51Ieqr2QJPGppzPvvhqJolbyzi/&#10;8EzTfLU1HwUAwIZkEACQq2uvnkh4nnuhOg+TMZtsfuwTX6rd89eQECatHbSNs/F/wOwPAAAbHiAD&#10;AMjFhs9er2uvNpo0pnjC5fFD95idmqR5GIspjxiN5f6lT/xR/fN9X3imngTaXgcRJWycwfegVjDp&#10;eAEA1UQyCABIJC5xCpNXE1EfiU+aGM+++Kquu+pS3ff5Z1perxEkbknnSdQ4g1rHDXddn3i8AIBq&#10;IhkEAOQuTc2aKx+JT5oYUeV97sXXUr0GImqc0sQ7CQEAcEEyCADIxbMvZvPy8zRJU1I+YgAAUDQk&#10;gwCARGyJU2PT0fs+T+0UAADdgKeJAgDa1vgwkw13XZ/qlQkAAMAvkkEAQNuee/G1TF6oDgAA/CEZ&#10;BABkwnyheuPL5gEAQPGQDAIAMmF7oTrNRQEAKC6SQQBAZu77wjM0FwUAoEuQDAIAMkVzUQAAugPJ&#10;IAAgUzQXBQCgO5AMAgAyR3NRAACKj2QQAJALs7kotYMAABQLySAAIBdmc9E/e+QzDb8CAIBOm2J2&#10;AAAgK/d94Rlde/X7dd1Vl0qSnnzkNn3sE19q7inG8UP3mJ0iPfviq4ljAABQRdQMAgByZTYXzZuP&#10;GAAAlEHPgQMHxs2OAAC769Zeqme3vSpJ+vCiw/XuTx+YXf984YUX1j+XxWWX/pPOn3lS//z2DH3n&#10;1YvNn2O956K39J75P3QePoiXRliM69Ze2vT9nQf/RmcX/1CTD87ReXf+TNNvwTJGsbz55pv1zzcs&#10;OV7//LcvL5TUvH0CAOL1aE4fySAAOBqfv189R5ZKam6+2JgMrhwcqn9GsTUuTxTf7h1b658bk8HZ&#10;ffdKYnkCQFI0EwUAAACACiIZBAAAAIAKIhkEAAAAgAoiGQQAAACACiIZBABUFk+eBABUGckgAAAA&#10;AFQQySAAAAAAVBDJIAAAAABU0BSzQ6cM9Pdp0eV9Zue6l185pOGRQ2bnQgrKkmSa0wzjS5GnrVHc&#10;OuSq6OXsFt2y3uTBZV1MO19cxt0obRwbl9gu8VzG48IlVpbaXafTDJ9mmEZJh0/av6nd4bOQ1TS0&#10;O5649TzteKOYMfOIEWh3/rjKO445z2ySxHYZn6skcU15zzfJT4y82JZT2nLYxpVW2mloRyGSwVXL&#10;l2n1imVm5xbDI4e0a+8+7zMpiYH+Pm1af3v9+8YtD8dOb5phfCnytDUyp7NdRS1ntzCXR9Xmp+u6&#10;mHSfZs5XVzv37NOuvfvMzom47qel6HKlLUMYX+uWOd1J46YZPs0wjZIOn7R/U7vDZyWLaWi3LK7b&#10;SxbbZiAsZpYxAu3OH1d5xwmbZzZR+7WAOb1ZSFNmczrSjCOOjxh5iVruScthzocsJJ2GdnW0mehA&#10;f59279gaukBMwQzftP52DfRnk4FnbdXy5rKY323Mqwnm904yp8X8XhRZT1fW46sac/6Z31GTdJ+W&#10;dj6uXrFMu3dsdYphSrqflqLLlbYMYbIeXxgzjsu+vZE5vPndxuzH/B7FdoISN7z5u/k9Spp4PiRd&#10;TgFzONeyJN1e2tk2A3Exs4hhSjt/ksorTtw8s4narwWymr5GacZpDmN+z0IRt/c4Lst90/rbW9a7&#10;KHmUO49xRulYMmg7cLgKhg3bGDtl1fJlLdM00N+XaKVCOi+/ku0VlKzHB0TxtU9LGqOd/bRkL1fW&#10;21bW43M10N+XaF76FLbc8ppXvuMlkXYZpRkubD64MLcTV0lipo1h8rXu5xUnyTyzCYa3TVse63ya&#10;cZrJjvm9Xe3Mv05JstxXr1gWuoxNaZZPnDzGGaUjzUSjqmd37mltyhC2Q1h0eZ/XalQU1/DIIW3c&#10;8nDo1RRzHRoeCW+T3Yn22ign2/5Mal0fA0n3aVHrsWQ/Adi0/nanJihRB852ylWmbXXT+tu1cnDI&#10;7NxRYcvNZZmn4TteGquWL0vUTDLNBdyw+SDZt5d2ts1A3LmU7bekMWzSzJ808oiTdDlJrfukgG1/&#10;Hbd/i2JbXjv3RDdLtbFNq1TrnnRcNraKj6JzWe7m/K8t9/jtJe0yD1uv4uLlwXsyONDf1zLDpeg2&#10;7bv21oYzV0DfmXOcsOkJ645sRZ00Ss3rzvBIre0/kIdg/QpbH7Pap8Wtx7v27rOeMK5avkzDIw83&#10;dTPZTsSi9tOSe7nKtK0mTTTyFHbCk9fJhe94aa1ekWwZmduLC9uJYNT20s62KbmdS7UbwybsBDZr&#10;ecXJc78WiN6/2dmmK+2+z7YuSvbkNamw9a7obPPXXO4vv3KoZRlLbttLmmU+0F+cfafXZLCdA0dt&#10;RtcWxqrlyzp+RdhmeKR2daCxjC5lA1AuG7dEHzgkf/u0XXv36eVXDjXtl4ITrbB4thMx132Zr3IV&#10;RdJEIy/tHF/T8B2vXa5Ju+2k0YWZGLjMhzTbZsB13rcTwxS2zLOWV5yi7tcG+lsTrOGR2vlkGua4&#10;Alnsq9JuH53kutyDZbxpfXPz0LTbSxQzhpQuocyK13sGbVcrbAskzq694VfcOy3YgHfu2ZeqbACq&#10;J+99mu0gY9sfB8zfbMO7yLtcRZHHiWsSYSfPeR2DfMfLQtgJssm1P1PaY79t2zK3P5PthDwqpi2G&#10;bRxRVi2v3UOVt7B1KwvmfLXNFxdZ7tfCyps2ETQTDFPc71FsCUw3SLrcbduSOY522OZjsP/oFK81&#10;g6Y0baG7QdyKBgC+DY8cajkAuWJ/Fi2PK8euok4m85ge3/GyFFc7mDRBMqU99rezbUpu51K79u5T&#10;Y7M013irlrc2M83DQH9rM8y8xc0zH8K2pbTikpY0TUV9rQO+uJS/3W0yTBETQanDyWBeBvqzfwlm&#10;knG69Bv0E3w2f5NaN7yo8Zkax29KMh6bsHG3O95u5GNehMWQJpomxa1vcXzESCNquqRs5zPQDpf7&#10;SrI20O83MfMdL2sD/X3atdfsOsE8FheVeWJuNlG1sS2fgf7wxCBsWQeyPFmOipVlnKKxlbndbclc&#10;N0xJmorGLZfhkUOx8VwEx/mkx3PX4cxpdNlezH6SzLcwRU0EpQ4ng1nMXJO58ra7YUnJxunSr9mP&#10;aaC/tX1zwDY+k8tVHPPGWVcD/a1t2xulHW83iluOWcyLuBgml/XD5CNGGq7T5Wt6gEbmSWqw3/a1&#10;LoZtH3ltD77j5SFqGUUdd4vOVh6bnXuanzAaVUsUdRFu45bakxOzml9hsbKOUyS2xMClhjeplYND&#10;2r1jq9nZSdhykWo1zVG/uzL3K677k7TDSW7bi0s/Sdj2L8MjxUgEJc/3DJqZttR+swyTuXKa39Mw&#10;x2F+b2T+Zn4P6+YqatiB/viXaQZWr0j3Etq4/tOOt9u43D/R7rxwiWGKWj9sfMRII8l0bVqf7AWx&#10;SM5ln1I1wyOtV6Nd19l2mSdCgSQnREn4jpensH1FWHcfkhwjkvRrMs/BorZrs1+plqzksczNWMFJ&#10;ctZxTFHlz1NYc1hzPiRlrsPB/DPno9lfGNv07NyzTysHh1rGmZZ5PuE6bWZ/5ngCtvmcVtpxhe0/&#10;i8RrMjg8ckg79zTXlKxesaxlobbDXHmz2NjTrgBhzGlMImzYtCub7epUFvIab6cF8znJepV0XqSJ&#10;kZSPGGm51GybVq+wH1w7pUjTEkgyT2012mn2L2Vnu6qb5fHMJmxfn9fJs+94WTOncaC/9Qq9rZs5&#10;XJ7M2LbtL2Ce9JrnVFFsZTJjB4KEbOeeffUEIMsHpzRqjLVxy8O5rVu2+Wpbt/M00B/eumrT+tu1&#10;aX36i5vmsgxLBs3+woStA1kyz2nD9jeNbOdU5ngC7WwvZr/muFxElWegv1aBE3ZxwCfvzUR37W19&#10;EerqFbWTvyya1ZkrvVSb4bbursyFlMU0Bs0fpNYD0fBI6xVnKfz+qKiVzVyZzXkv1VZw23jjNI7b&#10;Nt5Vy/3fQ5M3l/lsmxeb1se/uDTgEkOyx3HlI0YaYQdKc7qk1mkr0vq2af3tGh6JftegT7aTi7j9&#10;2M49zfvq4MCVxX66TMz5tHpF9rc/BMK2D9d9S1K+4+UhmM7GY6y5rzC3j+AYbB7782CLnSezXFHH&#10;/7BzkTz4imVur773a3EJRXA+ONDfl/j4Ya6vQXnM826zvyh5LxfbthaU3xY3+K1R3tPYjrjlLU2c&#10;y3Ryv+o9GZRqBbadjK5eUUsKgwWbdsM0N/aonV2cvHbUzStvey9Zts3LsB3brr2tL6ENu6ISJpi+&#10;xnlhG2/UBt2NzHVBcp8Xktt66BpDqsWxXSGL4yNGGgP9rRc1wqZLqq23jf0XbX2rTU9t+nbuqb3r&#10;qxPTZlsXbcm1KWy/kNV+uizMEy1p4uJP1mzbYZ4nEL7j5WXX3ugnaZrfd+3N5n6oOAP9rcl23vN2&#10;eMRPkltUnd6vhcU3BcePlYND5k9W5nHdXI/M5b5qeX4XrZIKcoLG6bNdQA87R8hjX5sV1+Ut2cvs&#10;S0eSwWDhmQs1EJzUBRtm2MlgGHPmr14RvtIP9Ls9jSjg0o9P5g5Aij9Y79pbSxRXLU/+4tSoDa92&#10;wG2+auOSAHUL20E7al5IzcNErYeBJDGk1h28Cx8x0rCdfEVt+8MjrVcUi7q+Nc7z4ZHk+7QwtbK3&#10;7gMC5rIOmPtIm2C9cN1PB+WqInM+BfMmi2Ucx6zlypvveFmw7SuCk2HzGBr0a9sfZcl2Yiu5bZtI&#10;r9P7tSC+uX6Z504B16TNHNbc95jr/0B/9JN1faudPzYvE3NfY26rUnwLl04LW96S/fi8ab37BYAs&#10;dSQZlJpnkG2GBGobSK3JletGaW4EUm08ZndzZ2xLosxpK9KOOthhNdq5x/0k02VemuLGbe5wysK2&#10;E4pKoCR7jUHUjj1NjKR8xMiKy7rcjetb4z6t3aQw7AQiim0/FybZfrrWTydrQTslOD41LgvzRCYv&#10;A/2197OF7Vey5jteVszlE1ycM9drH+utee4RSLJtIr1O79eC/UWjXXsnti3behrHPA6Yw5jrutl/&#10;pwXLxLyoFtSWmTWHUvdsL7blLdWWyarlrS13OrF/jX2AzOahQbNTZoZHaidDKweHtHPPPr399ttm&#10;L3XBBmlbIWzMGW/Lyn998Kam77Z+TOZ4XeUxH23TG6xAecSL4ive5qHB+p8vtlguzewk9/5s2hnW&#10;1ZEjR8xOubHNxzRWLa89dCruyblZxUvD5SAVHOhc9mdZcZku0/DIIX3oAwvq++m44ZPsp20++pEP&#10;m526gnnwDk4k82Aug9Ur7A8gyGob8B0vD+bykWR95L6tPym79TLY7k2N26bv+VjmeGGxzPNPcx03&#10;uezX2j0/CRIik+0irjRRNvP3sLKY3c3h4qQtl6vhkdakaaC/NUGW7P22I++ymYJ4u/bWHs7TKGz/&#10;mpZL2WKTwc9t3WF2ysWuvfv0qV/7zdgNM2xHajKHt83Y+fPnN303TyzNDcUcZxI+5mPjCuUjXiNf&#10;8T63dUf9zxefsXz7+l/9rdkpN2nmY3Ag2LT+du3esbWeAJrbqk2aeFkJDuorB4e0cUvtaWxh4k4w&#10;srBzT3uPAw/m5a69taf9xe2npfTl8rlOZsl2cuJyrEpq45ba0xZNtlhZbAO+4+UpajuUon/PYr0M&#10;O38xL9L4no9ljucSK6v9WlbnJ1HrYaMgjjk9YdNvdjeHi9NuuVyY24LUem4eHF+z5KNsjRrj2S5A&#10;2Sp70nIpW2wy2AnBhmlbKQJmomYyZ6650ocNH9Zdat2QAOQnuBKb5CpZkZpxB4ZHJq5Ah+3TbCeI&#10;LoZHaq/rifrbuOXhlv1hFswTKJu05epWthOUqGNKUo0nqrZYWc9v3/HyFrcdxP3eDtdEMG+u+9Kq&#10;6sb9mrlMw9Zjs7s5XFGY02mK+70bha1rvhQyGQwE2b9tZ2leKbAxh2k8KIdtBI3dzRhFPNEEUNuR&#10;2vYTRdO4TzOlSRqCRDPqz8c82bV3ormVKU25upk5D8zjSFaCCwGNgpr0PPiOlxezDIGw7lkoSiIo&#10;tZ77cF4Trhv2a7bpWLW8diuF7c9k69ZpwXHSphPbTBUUOhkMhK0YcSuxucIEO8GB/vB7OYLfbL+b&#10;4wPgX3BSGly9XTmY38uQ82I7sU5SA1pUu/bmf/9D0dmuWtsSgSzY1vs857fveHmwLR8pvHu7sk4E&#10;zeQtycUG23JKMw1VU9T92kC//QE4wa0Utj9Tp8uQt3a2F7Nfc1xl0hXJYMDcGOOYO/dgpY9ri7vo&#10;8trrJholjQ0gGzv31A7EQeK3cUut2WO3n8SY+ycpft/UDcpariTMi5dhFxizYMaS8ks+Jf/x8mDu&#10;O8zvWck6EZTam1ZzO+S8xl0R92tZxM9rv9SOsO1Gir5n06ad7cWU5biKpquSwTTMhbdqeevVEXOH&#10;WIQrPkDVBQngrr215o5lZO57yqKs5XI1PNL6MJk8jym+EzTf8bJm7k/M71kIO6FtJxEM47pumec+&#10;Za7pyENZ92txrex8i5ueuN/juGwvLv2USeWSQdsCth0IzP5s/QAAYOPzmDE80trseKA/v/v5fMfL&#10;2vBI7daToLm5eZ7QrrwTQXPeu9QQmec0Uuv5EbqLuUyD7TLuz1zu5ng6yVbzZ67vYdtXGHN4l+3F&#10;7MccR9l07KXzaZgriAvzypc5jmAB79zT+vLZbrN6xbLMXoqKaAP9fdq11+zaylzfknCN0Q4fMWA3&#10;0G+/36PblbVcSQW1g+3sA5LYtXefBvqbm6PmeUzwHS9rwfLJWtiJalaJoI3LfDcT9ah+0SrJfm2g&#10;v3arUdwyCeO6zzD7c7194uVX+jTQP7GOmuPpFHN/ItXWU9u+JvjuUl7TQH/8eY85HXHaWeZJ1q28&#10;eK8ZHOhPd/XQdrXATPRs4hZKMI6ocfm+ImCWM4xtmm3zKcyq5TSHdWXO64F++wG/kbnzklrH08j8&#10;zSVGUj5i2KRpeu06TDeux2Hz3Vw+nZRmX90N5fLJ1pwyT7Z4tuWRFd/xii5s/c86EbTVOkcd+23H&#10;Its4qiDv/VrQ7+oV8S+pt7ENExbH5LqO2fqzjc8n2zweHpl4eKRtG7LNKxtz/tm2h0a28ZrjaNTO&#10;MreVW4qOlwevyWDjDNu9Y6vTTAuGMftLclUvLJlrHEeS8WXNXOgD/W47q8YNpdGm9bdHDr9qeW3+&#10;p1lxq8q2foStm1JtHpsbuG0cjWy/R8WQku/AfcSQWtdpKT5pSzpM4/4kavqLJphuk+1g1ymN89Z1&#10;X21b56VilasTwo4/eQk7JuTFd7yi8r1dh81389hv2y5tx4Eq8LFfM5sX2paJTdhxOGxZmXGS7mfM&#10;/s3x+WabR+YFC/O7ZB/OZJuHtuWSdBkEzHlnG4dN0nUrT16biZozbKC/VlUdNaPDqk5tK0UY20mm&#10;1Hp1ZHjE3qQnSaw0gvI3xl69ovagm8YN9uVXWufT8Eitjbg5n2zDB91Niy5PV9VeNbWmCs0bbrAO&#10;N85n2zyW3NYj1xhSeJw4PmIMj9QuVDTu6Bpj2OZF3DAmc9qKtB5vWl/br9mY0y3VDsxh/XdC0n21&#10;rUxS8crVCbv2tu6f82Q7Jgz01y4w2ra7dvmOV0TBSaRpeOSQFl3e+nTyKLbjvI1tvkvNx37zt4Dr&#10;chnoD59281yp9t0ez6VMYbGyjGOOP4/9mu18s3GZhAmLFbaszP5tcaOY/a9eYd9ew5aLlN2ysSVP&#10;toRoeMR+jrBp/e3WiyONbOc95nIx52nANl8amfNSqpUpzfKOWrfy5DUZtM0wKdgg7SubaXik1n44&#10;ycwK69dcwLaDdtiwWbOtqFLrCmPbQHbt3aeXXzlkPRiZw9uELRc0C3ZEttqquPlsW2427cRw5SOG&#10;FH2yEnZgiBomTpHW4yT7NNd1w6ewednt5eoU8wQmb7XjSfOyitru2uU7XpEEJ6M25jxx5brtpDn2&#10;u447qlw2cWWNipskVjtxfOzXguOrrTxhy8RmeCT8XNc2rbb+otj6H+hvvqCaZLlI8fPRNu9swwyP&#10;hO83gt8ahwnGETaMlG65RC2DRmHjDhtvGNv88cVrMhjMMNtJqIuwGgUX5glmWMZu9udrwYStTKaw&#10;2g/X4U2+V76B/vCrTO3yceJR2xHV1mHXDT3pPE4TIykfMaSJCy5mjLD1WAofJortalpu69rzrQfN&#10;tGzTXQTt7quTrvPtaHc5v/POOy3NhQJZ7VNq25u95UleNm55WLt3bG3qFrXdtSsqXrvLqMjyKFeS&#10;5RRsqy7H/iTbZdbliipTlrGi4vjaryVZJjZx57rm/Ao7n41jnu+a886M0y5z/EG3RsG8ixLM28Zl&#10;aBu3KclyiVsGpuER+4VsV67rVl68JoPSxEnoQH+tGYnrBtnujDKvCJnfA2Z383scs3/ze5ThkUNa&#10;OTgUeYIeNT6X4QOuK7oZz/xuMn9v/D7Qn+wqUxph60nUdKURdUU24DqPw7jEaJfPGI3be9z8TzJd&#10;tmWe67r2fK0JSNwBK45tuuOY8838nqU0++p213mptUzm90ZZLOfR0dHI/WWwnMzpML/H2bW3ufWH&#10;y/BmP+b3OOaJT9zw5u/m9zi2eFkso3YkLUPAHM78Hgjr3o6k44w79qfZLpNOQ5yo8UX9llTcuHzt&#10;1+KWSRiX44JZRvO7K3O4uO/tso3P7OY6n9PsTyW35eKyDGySnLcE0qxbeejRnL5xs6NPLlcMX34l&#10;m6uzQay48bn2F6bd4SX7fEkyPtvwgSTjkZKXJ6z/qI0vK1EbVth0tSNsPvuIIdV+azyYRZU/io8Y&#10;Um0dSDJvoqZLCp/Pea5rK9ZfqT1bXtLOPfv0B/dfXe/+9IHZ9c9xV2rDpttFHuuxi7TLIg3XMua5&#10;nAON67vrdIVJM3yaYRolHT5p/yZz+DyX0Q1Ljtc/z+67V5I0Pn+/PjR3bVtlCJhlCRO3bSQRFyuO&#10;OS3tjM8cV1ou05BFLJc4pri4acZpiosRSBLLdd2MEzce12mPEzZ+KX4awqQdLmArW9pxNbKN1yaL&#10;WFnpeDKI6hjoz/8KcdorOt3KPNFqJ1EL4yNG1vJc14JkLlwV8gAAIABJREFUcOOWh/VXT36y3r0x&#10;GVw5OFT/jPzkuZwDVdunZC3PZRSWDPYcWVrvDgCI5r2ZKKpreKTWXtvlikkaRbrK4stAfz7zspGP&#10;GFnLc11boStJEAoii+U8eOty7XjU/gbiKu5TspbFMmqUVy0jAFQVySC8Gh7h5CorA/2tT+F6+ZVs&#10;562PGHnJa13bOX9DLuNFOu0u5zv/za2Fr+nudu0uo0YkgwCQLZJBoGAa25uHnaTaml4lOeHyEQMA&#10;AADFRjIIFIiZgK1e0fqiWlttnRSe1Jl8xAAAAEDxkQwCBWK7r8alWVSSe9h8xCiKoAbU971fA/3x&#10;7zwCUFyNrSckLoQBKC+SQaBA0tyPlzRJ8xGjCMwaUJ9lCN5D6CsegOyY+w5pogWF7wtLAJC3SWYH&#10;AJ0zPFJ7IarZbNNmeKT2lL6kJyY+YhSBWQNqfm+XrRlto6zjAfAjbNtdvWKZNq2/PXbbB4BuQs0g&#10;UEC79tbe5bdqub35ZhZXp33EKLNazcHEe85MaWpgAXRe3La76HKagQMoD5JBoMB83KfiI4ZPwb0+&#10;5tX72veJxLedcocl0IG42lTzfiQX7STnaeIFXOPmGSPPcQfSxHAdt02aeAHXuO3eM9vu8Da2baed&#10;bTFQH+/z9himqDIFLSKC5WPeU716xbJMphkAioBkEEAprFq+TAP9rUlgwPxt9YplGh6pnRBGnRja&#10;mCeHpqhxDfS33o/kKpjeJCei7cQLuCS3ecXIc9yBdmJ0yzKJ69/U7vCBIKE0t79G7WyLgfo2+Xz8&#10;9hmIKlMwPVItWd29Y2vT76uWkxACKAeSQQBdbaC/r54IJtV4ghp1YpiltLVB0sT0DvT3adfefU7T&#10;2068QFyzuDxj5DnuQDsxumWZrFq+TMMjDzd1i2IOHxfPxkwoo3RqW3SNs3PPPuckEwC6SewDZDYP&#10;DZqdcuMzluQ3ns9YUnnjbR4arP/5UtZYkt94ecXK6oEO5slvkSU5yc7C1R/+oNkpc8F9WnmsJ3H3&#10;gGXBdZlkVb6kZQoumuSpsWyu88Mmq206TpJ5+NGPfNjslJus1hFXZY7nO5bP8xNfcQJljuczluQ3&#10;nkusHs3pGzc7AkA3WLV8mfVqfXC1v/GEsrHZV2MtRMC1NmJ8/n7t2fKSJOmGJRMPkHn6wOz655WD&#10;Q/XPJnOaG6crjG16pVptRVxTtTTxGrk028szRp7jlqQDT+zQg198NHGMblsmgah1s5E5vEu5AlGJ&#10;oFnWpPOxsblm4/b3+d//gYZHDmnn8xu0+pr76t3DuMzDRu3MDwAoMpqJAuha5snu8Ejt3q3hkUMt&#10;TUeD3yRp195at6CmJOmJYZYapyvMrr325rCrVyS/b8klXrvyjJHnuAMuMbptmQQ2ra+9AzMvYYlg&#10;WPLUuC02bs9Jau2kiXm4c/4GaxwAgB3JIICuZGvylvQkt5tOGms1Kg/zIIsC6cZlEtTE5XXxI2y7&#10;jIu3a2/the6LLs/26aUAgGix9wwCQDfYuaeYJ99Zq0o5u0m3LRNbwpYFW5NPl0QwENTuufYPAGgf&#10;ySAAABViS9qyYCaZtZpTEjsAKDKSQQAAKsZ2X1+7zASzqE1lAQATSAYBlIL5MBkAE2xNWc2avHaY&#10;46JWEAC6A8kggK5kq3XIo7ajaMzaF3RetywTMyFcvaL5SajtMMdDIggA3YFkEEDXMk9ug8famyem&#10;ZWG71yvpI/iRrW5aJraHs5g1emnY5oHtYg0AoHh4tQSArrVr776W5qG1E9PbW056u12Q6DZK0xSv&#10;dtIengBk8Vj/PGPkOe6kummZBHbt3aeB/olpDhK5dsa/6PLO1wrW5+Hz9gQ3y3kIAGVCMgigq23c&#10;8nDLi7+l1mZrwcli0U4K4xIByV7zIqWrfQkbV6MkrwOwyTNGnuMOlHGZBIJktTHepvW3a+XgUENf&#10;7cliOpOqz8Pnw+8fzmoeAkCZkAwC6Gq1k9taQhh2Eig1n3APjxTnfWYuiYBNnie2iy5vr6bIRZ4x&#10;2h132ZeJWTso1WrT0iSy3STLeTjQ36dde82uANB9uGcQQCns2rtPG7c8bHa2GuhPd2+hrflZJ+SZ&#10;dEh+7nnLM0ae4w7TTctkeORQy/22WT5MpqjamYfmsAP9fYXZHwBAO6gZBFAawyOHtHJwqN5sNO7k&#10;dtP6251O4oPkUZL0fPNvPmVRozk8Et1MNotmtHnGyHPcaXTLMjHZ7rddtXyZhkfcLqhE6UStWTAP&#10;V+jKlkRXan8eBuNv3KesXlFrjeCyDwGAoiIZBFA6teZuzTUdwcmamSDGJYRNiWAOzETAlsRmkXAE&#10;gnHlKc8YeY47UMZlYrNxy8NN63ZQzqRlstWa+RbMw53zN+Q2L23Na6X4fQgAFBnNRAFUwvDIIW3c&#10;8rC1KWlUcy/zSYlZC05igz/bSWWaE3SkV5VlYia9UvS2EMYch9SZhLCT8t5PAEBeSAYBVEqQFDay&#10;1fwEzFoPH2w1G3nWTiJeWZeJWa6B/nT3wplNM8uYHEWVqRP7CQDIAskggMqx1YiEnegFyaN5spun&#10;4ZHWB3xEJazIX1mXia1c5r2ELsxkKM04is5Wpp177DXHANAtSAYBVFKSk7eg2WCW72KLY7sfLc0T&#10;UJGdsi4Ts3ZQsic+Ucz5IpWrqaittnTl4JB1nQCAbkIyCAAFZTtJt52Uwp+yLhOz6XQaZlJUhvkS&#10;xqxNBYBuRTIIAAUVdn9jmU+yi66sy8TWdDopM1EuQzNaACg7kkEAlZS0GVyn2E7Sq/CC8CIr6zIx&#10;k7mkbPMlSTPaIKl27R8A0D6SQQBdKzh5TFIrM9Bvf29guyfCeTJroqRyN8HrBmVcJrZkLinbdrRp&#10;/e2x82bV8mXatP52rV5R+09CCAB+8NJ5AF3JTOpWr1jWdDJrnkzWmqzZTzK74f4f2wvCVy1fZj35&#10;jlIrf/SJeaOXX2k/QchSkaa/jMtk45aHtXvHVrOzs6AZrXnBZfWKZS3bqBTelHTR5cne41ifh8+7&#10;JeV5zkMA6CYkgwC6ku1VEGEnllJrctgo6cl7JwQn0Y3lWL1iWeKT2qh5FKZIj84v0vSXdZns3LOv&#10;rWbUYQmh5F5W81UVcerjfd69CXie8xAAugXNRAF0paQnizbBSWu3sE2rLSnOmo8Yecpz+su4TLJ4&#10;XUI725avJC3PeQgA3SI2Gdw8NGh2yo3PWJLfeD5jSeWNt3losP7nS1ljSX7jZR0rONncuSf5ievw&#10;SO1F275OOhuZSaz5PY55gh03fNzvLq7+8AfNTk3MGOb3JMz1pJ1xBeLGYf5ufo+TZJlsHhqM/N1V&#10;3DjM383vcczacpfhzWWXZBvtxDbpUqbARz/yYbNTbsz5mLcyx/Mdy+f5ia84gTLH8xlL8hvPJVaP&#10;5vSNmx0BoBs13itkNkcbHqk13Xv5lWRN+Ezj8/drz5aXJEk3LDle7/70gdn1z3Evpx/o79Oiy/tS&#10;T0vS4YP+00gaw7X/JPKc/gNP7NCSGwfbnv6kw+dZpkDSaTK1O7yN7X4+M/GM0ng/Y+P292/XvSBJ&#10;2vn8Bq2+5r569zBJy7Rqee2ex8DOPfsSTTcAFBX3DAIojeaTs+ZH1A+PHCrMyVuQmKaVdPik/aeR&#10;Z4w8xx1oN0bS4ZP2n0a7Mdod3iavbTAY7875G3KLAQBlFNtMFAAAAABQPiSDAErJvB/I/A4AAFB1&#10;NBMFUErDI7WHV2R9zxMAAEBZkAwCKK087nkCUD0u70YEgG5EM1EAAIAQq5Y3P4xKotk5gPIgGQSA&#10;hMz3ypnME0cA3WWgv0+rli/T7h1bm14pIdHiAEC5kAwCQELDI7UXZIfZtP52EkKgSw3092nT+ttb&#10;ksAAr64AUCYkgwCQQtwJYdoXigPorKhtd+OWh6kVBFAqPEAGAHLAPUVAd7Jtuzv37Iu9AAQA3Yhk&#10;EAAyRu0B0L0aX0sj1ZJDtmcAZUUyCAAZ48QR6G48JAZAVXDPIAAAAABUEMkgAAAAAFQQzUQBAJWx&#10;uHeKFvdOHPomP/WU1s6dUf9+cPSMDo6eqX8HAKDMSAYBAKW1du4MLe6d2pQANnnqKa2d22t2lRQk&#10;hqe17dhJ8ycAAEoh5OgIAEB3Wjt3RmiCl0RQixiMa9uxURJDAECpkAwCALpekLSF1gBmYO3cXq2d&#10;26uDo2e07dgozUkBAF0vv6MmAAAePLRgVq5JoGlx7xQ9tGCWDo6e0R1vnDB/BgCga/A0UQBAV1o7&#10;d4ZeuOwCr4lgo8W9U/TCZRc0PYAGAIBuQjIIAOg6Dy2Ylcl9gVlYO7dXDy2YZXYGAKDwSAYBAF0j&#10;qI3rVG1gmKJOFwAAUThqAQC6QnCvXrtmLT1rdqo7sX+y2SmRhxbM0h1vnODhMgCArkAyCAAovHYS&#10;wVlLz2r6wnOavnBcknT/Y6eMPias2zRNkjR2uEdjhyelSg5JCAEA3YJkEABQaGkSwekLz/04CRyv&#10;JX/HpAd+47TZW4sHHq/1c/dNUyXVksOxwz06sX+yxg6731lBQggA6AYkgwCAwkqaCJpJoEsCaBMk&#10;hQ88flp33zRV69YkTwpJCAEARRd7RNs8NGh2yo3PWJLfeD5jSeWNt3losP7nS1ljSX7j+Ywl+Y/n&#10;k++y+YxnxkqSCM5aelbz1pzRgy+N6ZJb364ndO164PHTuuTWt/XgS2Oat+ZM5D2HJnP6zfLlyWcs&#10;yX88n3yWzWcsqdzxfMcK/nzwFSdQ5ng+Y0l+47nE6tGcvtpNFACAWOPz96vnyFJJ0vFD99S7P31g&#10;dv3zysGh+mekl+Rl8vPWnNbB0TO6ZdNJ86fMfXXjDC3unaKj22tNSePwcvrs7N6xtf75hiXH659n&#10;990rqXn7BADEi60ZBADAt7VzawlXnOkLz2nemtN68KUxL4mgJN2y6eSPawlPa/rCc+bPLRb3TuHF&#10;9ACAQiIZBAAUjssL5WuJ4Bl9+iujmTUJdfXA46f16a+Mat6aM04JoUt5AADwLf6yKwAAHpn32YWZ&#10;tfSsbtl0Us9/0/0evvPPn6krLr9Ml16yQLNmzdSZM2d17K0f6rXXv6dvfeewTo6NmYOEev6btfhf&#10;/lSv00NlggfKAABQFCSDAIDCWNw7xal5aNA01DURXPDe9+iWFb+ka37uZzRjxnTzZ0nSj46f0F/8&#10;12f0+BNPOSeFz3/zrB58aUx3rlHsPYRB2Xi6KACgKOIvZQIA4IlLc8pZS8/q4OgZp6ahPT09+vgv&#10;L9Pv/MfPael1V4cmgpL0rtmztOrjv6zf+g+f1Xm97vf4PfB47eE1Lk8ZdSkfAAC+xF9+BQDAk7ha&#10;wekLz2n2R8/qllvdHhZz/bVX6X/55M1N3d743vf19986pGM//KFmzTxf/R/s08L3/0T99yv6P6Db&#10;Vn9cv7fjkYahot2y6aRef3SyTr3aE9lkNK58AAD4xFEJAFAILk/cnLX0rO5/7JTZOdTBvx3WkR+8&#10;qfkXXah//O739MUv/4n+bvjvde7cxENfenp69NEl1+jfr/mEpk+bJkn6l7/wET2298919Nhb9f7i&#10;3P/YKd25NDoZlGrl3HbMLZkFACBP0UcsAAA8iWtCOX3hOU1fOO7UPDRw/MQ/6wv/5Y/0X//bX2po&#10;4336m2+83JQIStL4+Liefuav9Cd7/qzebdq0afrQov6GvuI98PhpTV84Hvt00bhyAgDgC8kgAKAr&#10;JK0VDHzj5RH95z/4kk6ejH4ozNP/7a909uzEfX+XXvLehl/d3P/YKad7BwEAKAKSQQBAx7k0EU1a&#10;K9jo3Llxs1OLt350XG+//U79+8zzZzb86iaoHYzjUl4AAPJGMggA6LjFvdGvZUhbK5jElCmTNWXq&#10;xK3077wzkRgm4VI7GFdeAAB8IBkEAHRc3FM24+7Dy8JlP3mpzuuduJ/vlW8fbvg1mbjpjSsvAAA+&#10;kAwCAAqvnSairlZ+7F/VP//o+Akd/MbLDb+6c20qCgBAp5EMAgA6qgi1ZNde/bP6n6786fr3vU/+&#10;Pxodzff1D0UoNwCg2kgGAQAdFZcU5X2/4KXv+wndsfaT6unpkSS9+o/f1Z/+xdeNvpJxu28wutwA&#10;AOSNZBAAUFnvfc98/eb6z+r8mbUnh77zzqj+03/+osZO5Zd8AgBQFCSDAIBKuvjd87Xpc+t04dw5&#10;kqSzZ8/qd//gS3rt9TeMPgEAKCeSQQBA5Vz87ou0eeM6XXThXEnS+Pi4tn35q/rLF14y+gQAoLxI&#10;BgEAlfLu+fO0+XPNieAfPfo1PfnUfqNPAADKjWQQAFAZ8y68QJv/j3W6aN6FkmqJ4Jd37tbX/vQp&#10;o08AAMqPZBAAUAkzZ56ne/73X9e758+rd3v0sSf02BN/0dAXAADVQTIIAOiog6NnzE5NTuyfrHU3&#10;TzM7J/bvB2/Vpe/7ifr3r/3pU9r5tScb+sjOupun6cT+yWbnJnHlBgAgbySDAICO8pEUXfeRn9P1&#10;P39V/fuzz/93fWnn7oY+/PNRbgAAopAMAgAKb+xwj+6+aarZ2cn06dN02+qV9e/f/d739eC2r+jc&#10;uXMNfWXn7pumauxw7QX2AAAUGckgAKDj4mrJxg6nP1xdd83P6d0X1e4THB8f18Nf/GO9886o0Ve2&#10;4qY3rrwAAPgQfbQCAMCDg6OnzU5N2rlv8BeunWge+uo/flcvj3xbk3p6nP+ScrtfMLq8AAD4EJsM&#10;bh4aNDvlxmcsyW88n7Gk8sbbPDRY//OlrLEkv/F8xpL8x/PJd9l8xNt27KTZqUWapqLTpk5V38L3&#10;1b9f/J75+sOHflt/+PD/7fT36//uMw1ji+faRNSlvO3ysdwa+Y7nk8+y+YwllTue71jBnw++4gTK&#10;HM9nLMlvPJdYPZrTN252BADYjc/fr54jSyVJxw/dU+/+9IHZ9c8rB4fqn+HuhcsuMDs1mb7wnOat&#10;OaNLbn3b/CnUhRfM0fYHt6gnRQ2fJD33wl/rtz//+2bnUK8/OlNHt0+JbSZ69XfeMjvBwe4dW+uf&#10;b1hyvP55dt+9kpq3TwBAvOijFQAAnmw7Fn0f39jhSYlrB3smTdKp06c1dupUqr+zZ90fMhPUCsYl&#10;gnHlBADAlylmBwAAOmHbsZNaO7fX7NzkxP7JWrdmmh543O2eu6NvHtOvfObXzM65WHfzNB3dHn2v&#10;oOSniSgAAC6iL18CAOBR3FM2xw5P0vGvT9ZXN84wf+qor26coeNfnxxbKxhXPgAAfIo+agEA4JFL&#10;E8oT+ydrce+URM1F83T3TVO1uHdK7BNEJbfyAQDgC8kgAKAwDo6ecao9O7p9qu68crquuSI+AcvT&#10;NVdM1p1XTtfR7fGJqWvZAADwhWQQAFAod7xxwuxkdWJ/rblopxLCa66oxXepEZTcywUAgC8kgwCA&#10;wnFpTjl2eJKObp+iL3+q13uT0btvmqovf6rX6TUSklt5AADwjaeJAgAKZ9uxk1rcW7sXL0rtdROT&#10;dOeaWk3dLZvyf1LnVzfO0OLeKU5NQ6Va81CeIAoAKKL4y5kAAHRAkmaVR7dP1aLvT9Prj87MrZbw&#10;7pum6vVHZ2rR96c5J4JSsnIAAOATySAAoLCSJFIn9k/W0e1TdOeV0zNNCoMksPagGLenhgaSTD8A&#10;AL5Ft78BAKCDDo6e0R1vnNBDC2aZP1kFzUanLzynO5f2aN3N03T/Y6ckyflF9VItAZRqL5IfO9yj&#10;o9vj3yFouuONEzw9FABQaCSDAIBCS5oQShNJoSStXTpZ0xee07qbp0lSPTm0CfoZO9yjscOT9MZG&#10;91rARiSCAIBuQDIIACi8NAlh4MT+yU1NO9cuDU/w0iZ/jUgEAQDdgmQQANAV2kkIGyW55y8pEkEA&#10;QDdJdgMEAAAddHD0jK7+zluFS7iKOl0AAEQhGQQAdJ073jhRmBe5bzs2ylNDAQBdiWQQANCVth07&#10;2dHauKA2kBfKAwC6FfcMAgC62h1vnNDi3ilaO7dXi3vzP6wdHD2jbcdGO5aEAgCQlfyPmgAA5Cx4&#10;uIwkrZ07Q2vn9hp9tG/bsVFqAQEApUIyCAAolW3HTtaTtrVzZ2hx79RUNYYHR8/o4OhpEkAAQGkl&#10;PzoCANAlaoncRDK3uHdKU2I4eOsK7Xh0T/17LQGk+ScAoBpIBgEAlWEme7f94i9q24M7G/oAAKA6&#10;eJooAAAAAFQQySAAAAAAVBDJIAAAAABUUGwyuHlo0OyUG5+xJL/xfMaSyhtv89Bg/c+XssaS/Mbz&#10;GUvyH88n32XzGc9nrE7wWT6fsST/8XzyWTafsaRyx/MdK/jzwVecQJnj+Ywl+Y3nEqtHc/rGzY4A&#10;ALvx+fvVc2SpJOn4oXvq3Z8+MLv+eeXgUP0ziu3AEzu05Mb4gyWKYfeOrfXPNyw5Xv88u+9eSc3b&#10;JwAgXmzNIAAAAACgfEgGAQAAAKCCSAYBAAAAoIJIBgEAAACggkgGAQAAAKCCSAYBAAAAoIJIBgEA&#10;AACggkgGAQAAAKCCSAYBAAAAoIJIBgEAAACggkgGAQAAAKCCSAYBAAAAoIJIBgEAAACggkgGAQAA&#10;AKCCSAYBAAAAoIJIBgEAAACggkgGAQAAAKCCSAYBAAAAoIJIBgEAAACggkgGAQAAAKCCSAYBAAAA&#10;oIJIBgEAAACggkgGAQAAAKCCSAYBAAAAoIJIBgEAAACggkgGAQAAAKCCYpPBzUODZqfc+Iwl+Y3n&#10;M5ZU3nibhwbrf76UNZbkN57PWJL/eD75LpvPeD5jdYLP8vmMJfmP55PPsvmMJZU7nu9YwZ8PvuIE&#10;yhzPZyzJbzyXWD2a0zdudgQA2I3P36+eI0slSccP3VPv/vSB2fXPKweH6p9RbAee2KElN8YfLFEM&#10;u3dsrX++Ycnx+ufZffdKat4+AQDxYmsGAQAAAADlQzIIAAAAABVEMggAAAAAFUQyCAAAAAAVRDII&#10;AAAAABVEMggAAAAAFUQyCAAAAAAVRDIIAAAAABVEMggAAAAAFUQyCAAAAAAVRDIIAAAAABVEMggA&#10;AAAAFUQyCAAAAAAVRDIIAAAAABVEMggAAAAAFUQyCAAAAAAVRDIIAAAAABVEMggAAAAAFUQyCAAA&#10;AAAVRDIIAAAAABVEMggAAAAAFUQyCAAAAAAVRDIIAAAAABVEMggAAAAAFUQyCAAAAAAVFJsMbh4a&#10;NDvlxmcsyW88n7Gk8sbbPDRY//OlrLEkv/F8xpL8x/PJd9l8xvMZqxN8ls9nLMl/PJ98ls1nLKnc&#10;8XzHCv588BUnUOZ4PmNJfuO5xOrRnL5xsyMAwG58/n71HFkqSTp+6J5696cPzK5/Xjk4VP+MYjvw&#10;xA4tuTH+YIli2L1ja/3zDUuO1z/P7rtXUvP2CQCIF1szCAAAAAAoH5JBAAAAAKggkkEAAAAAqCCS&#10;QQAAAACoIJJBAAAAAKggkkEAAAAAqKApZgcAAMpqce8ULe6dOPRNfuoprZ07o/794OgZHRw9U/8O&#10;AECZkQwCAEpr7dwZWtw7tSkBbPLUU1o7t9fsKilIDE9r27GT5k8AAJRCyNERAIDutHbujNAEL4mg&#10;FjEY17ZjoySGAIBSIRkEAHS9IGkLrQHMwNq5vVo7t1cHR89o27FRmpMCALpefkdNAAA8eGjBrFyT&#10;QNPi3il6aMEsHRw9ozveOGH+DABA1+BpogCArrR27gy9cNkFXhPBRot7p+iFyy5oegANAADdhGQQ&#10;ANB1HlowK5P7ArOwdm6vHlowy+wMAEDhkQwCALpGUBvXqdrAMEWdLgAAonDUAgB0heBevXbNWnrW&#10;7FR3Yv9ks1MiDy2YpTveOMHDZQAAXYFkEABQeO0kgrOWntX0hec0feG4JOn+x04ZfUxYt2maJGns&#10;cI/GDk9KlRySEAIAugXJIACg0NIkgtMXnvtxEjheS/6OSQ/8xmmztxYPPF7r5+6bpkqqJYdjh3t0&#10;Yv9kjR12v7OChBAA0A1IBgEAhZU0ETSTQJcE0CZICh94/LTuvmmq1q1JnhSSEAIAis7tiAYAQAck&#10;SQRnLT2reWvO6MGXxnTJrW/XE7p2PfD4aV1y69t68KUxzVtzJvKeQ1OS6QcAwDeSQQBAISVJpOat&#10;Oa2X33Mq0yTQFCSFL7/nlOatcY+RpBwAAPhEMggAKJy1c2c4vaZh+sJzmrfmtB58aUy3bDpp/pyL&#10;Wzad/HEt4WlNX3jO/LnF4t4pvJgeAFBIJIMAgMJxeaF8LRE8o09/ZTRVbWBPT4/ZydkDj5/Wp78y&#10;qnlrzjglhC7lAQDAt/jLrgAAeOTarHLW0rO6ZdNJPf9Nt3v4fvLSS/TzV12pn/rgZbpo3lxNnz5N&#10;Z86c0Vs/Oq7Dr76u5154Sd94eUTnzsUnd5L0/Ddr8b/8qV6nh8oED5QBAKAoSAYBAIWxuHeKU/PQ&#10;oGmoSyL4oSsu1yd+5UZdcfll1trAeRfO1Qd+8lIt++h1+ubIt3X/Q9t15Advmr1ZPf/Ns3rwpTHd&#10;uUY6ur32OoowQdl4uigAoCjiL2UCAOCJS3PKWUvP6uDoGaemoZMnTdK/+fSvaFH/B6yJoOmK/g/o&#10;P24c0px3zTZ/CvXA46d1cNTtKaMu5QMAwJf4y68AAHgSVys4feE5zf7oWd1yq9vDYs6eO6ddX3tS&#10;G9bdrpNjY3rhv/+NXvzrv9P3vn9EY2Njete7ZutnPnSFfmnZ9Zo9q9Y8df5FF+ozt35cn/+9P2we&#10;WYRbNp3U649O1qlXeyKbjMaVDwAAn8KPWD+2eWjQ7JQbn7Ekv/F8xpLKG2/z0GD9z5eyxpL8xvMZ&#10;S/IfzyffZfMVz+WJm7OWntX9j50yO0d68aW/05/s/XPd8b/9pu5/cLv+8sWXdPi11/W97x/R37/y&#10;HT3y2BO6e8P/qe8f+UF9mGuv/lnNnnV+w1ji3f/YKcfawfhyZsHXcgv4jueTz7L5jCWVO57vWMGf&#10;D77iBMocz2csyW88l1g9mtM3bnYEANiNz9+vniNLJUnHD91T7/70gYlmhSsHh+qf4e6Fyy4wOzUJ&#10;nh56ya1vmz9l4l/+ws/rs//uM/Xvv3Xf53XwGy/B2QjiAAAMNElEQVQ39BHv9Udn6uj2KZG1g5J0&#10;9XfeMjvBwe4dW+ufb1hyvP55dt+9kpq3TwBAvOijFQAABZGmVjCJbx96ten7BRe43zcYcK0dBACg&#10;CEgGAQAd59J0cvrCcaeHxqQ1Pt7cUObMmeRJ3QOPn9b0hfENblzKCwBA3kgGAQAdt7g3+rUMedcK&#10;StL7L3lv0/fvfu/7Td9dudQOxpUXAAAfSAYBAB0X95TN6QvdXgSfVm/vDH38X//P9e+HX3tdr772&#10;3YY+komb3rjyAgDgA8kgAKDw8moi2iPpsp+8VL/1H+5S38L3SZJOjo3p4S/+sc6ei07owrg2FQUA&#10;oNO4NAkA6CjftWRrPnmzzj9/pmbOPE/vW3Cx3nvxu+svpP/R8RP6nYd3aOTb/2AMlb3FvVN0cPSM&#10;2RkAAG/8HoEBADDEJYNZ3y/4kauu1PyLLjQ7680339J/enCbhv/+2+ZPid3/2CmtXTpZJ/ZPNn+q&#10;IxkEAHQazUQBAJB04YUX6Lc2/K9a86mbNX3aNPNnAABKJ/pyLAAAJfPbn/99TZo8SefPPE/vfc98&#10;/fTAT+nDH/opTZ06VdOmTtWKjy3TTyy4WP/XA7+nU6eyv08RAICiIBkEAFTKtw4dbvr+xJ8/rQUX&#10;v1u/9qu3aVH/ByRJP/vhD+mTv3Kjdvzx4039AgBQJjQTBQBU3hv/9D9075bf1aHD/1jv9kv/aqnm&#10;vGtWQ18AAJQLySAAAJJGT57UI489Uf8+ffo0DfzUBxv6AACgXEgGAQD4sVe+/Q86e/Zs/fuCi9/T&#10;8CsAAOVCMggA6Ki41yuc2D9Z627283TP06dP6+zZiZfNT5ueLu66m6dFvlZCii83AAB5IxkEAHRU&#10;kZKiuRfM0dSpE89WO378nxt+zVaRyg0AqCaSQQBA4Y0d7tHdN001O2fu56+6Uj09PfXvh197veFX&#10;N3ffNFVjhyfGAQBAUZEMAgA6Lq6WbOxw+sPVzPN6zU5WH+i7VCt+eVn9+7G3fqhXvv0PDX24i5ve&#10;uPICAOBD9NEKAAAPDo5Gv9w97X2D5/X26nd/+zf1a//201r80wN617tmadKk2qGvp0eaNnWq3n/J&#10;An3yluXa9Bt36/yZ59WH/dqfPqWxU6fq31253S8YXV4AAHzgpfMAgI7bduyk1s6NrsELmoo+8Lh7&#10;InXp+xdo3oVzteyj12nZR6/T2bNn9fY7oxobG9OkSZPU29ur83pnmIPpwF/+v3py336zcyzXJqLb&#10;jp00OwEA4B01gwCArpCmdvB9C97b9H3y5MmaPet8XTTvQl0494KWRHDs1Cl9dfef6Xd+7w+bnirq&#10;yqVWEACAoqBmEABQCNuOjUbWDo4dnpS4dnDf/uf0D6+9rp/7mX+hf7Hocl2y4GLNnHle00NiTp4c&#10;0+tv/JP++m//P339wPP6H0eONozBXVArGHe/4LZjo2YnAAA6gmQQAFAILk1FT+yfrHVrpjkng+fO&#10;ndO3vnNY3/rOYf3xn5i/ZmvdzdN0dHt8rSBNRAEARRF9+RIAAI/inrI5dniSjn99sr66sfU+v076&#10;6sYZOv71ybG1gnHlAwDAp+ijFgAAHrk0oTyxf7IW907x8t5BF3ffNFWLe6c43SvoUj4AAHyJTQY3&#10;Dw2anXLjM5bkN57PWFJ5420eGqz/+VLWWJLfeD5jSf7j+eS7bD7jffzOTzvVnh3dPlV3Xjld11wR&#10;n4Dl6ZorJuvOK6fr6Pb4xPTg6Bl9/M5Pm51z43O5Sf7j+eSzbD5jSeWO5ztW8OeDrziBMsfzGUvy&#10;G88lVmwyCACAT3e8ccLsZHVif625aKcSwmuuqMV3qRGU3MsFAIAvJIMAgMJxaU45dniSjm6foi9/&#10;qtd7k9G7b5qqL3+qV0e3T4m9T1ByKw8AAL71aE7fuNkRAGA3Pn+/eo4slSQdP3RPvfvTB2bXP68c&#10;HKp/RnoPLZilxb1uD72et+a0Do6e0S2b8n9S51c3ztDi3ilOTUOlWvNQagWzsXvH1vrnG5Ycr3+e&#10;3XevpObtEwAQL/5yJgAAHZAkgTq6faoWfX+aXn90Zm61hHffNFWvPzpTi74/zTkRlJKVAwAAn0gG&#10;AQCFlSSROrF/so5un6I7r5yeaVIYJIG1B8W4PTU0kGT6AQDwza39DQAAHRA0sXxowSzzJ6uxw5M0&#10;dniSpi88pzuX9mjdzdN0/2OnJMn5RfVSLQGUai+SHzvco6Pb498haLrjjRNOT0YFAKBTSAYBAIWW&#10;NCGUJpJCSVq7dLKmLzyndTdPk6R6cmgT9DN2uEdjhyfpjY3utYCNSAQBAN2AZBAAUHhpEsLAif2T&#10;m5p2rl0anuClTf4akQgCALoFySAAoCu0kxA2SnLPX1IkggCAbpLsBggAADro4OgZXf2dtwqXcBV1&#10;ugAAiEIyCADoOne8caIwL3LfdmyUp4YCALoSySAAoCttO3ayo7VxQW3gtmP5v+geAIA8cM8gAKCr&#10;3fHGCS3unaK1c3u1uDf/w9rB0TPadmy0Y0koAABZyf+oCQBAzoKHy0jS2rkztHZur9FH+7YdG6UW&#10;EABQKiSDAIBS2XbsZD1pWzt3hhb3Tk1VY3hw9IwOjp4mAQQAlFbyoyMAAF2ilshNJHOLe6c0JYaD&#10;t67Qjkf31L/XEkCafwIAqoFkEABQGWayd9sv/qK2PbizoQ8AAKqDp4kCAAAAQAWRDAIAAABABZEM&#10;AgAAAEAFkQwCAAAAQAWRDAIAAABABZEMAgAAAEAFkQwCAAAAQAWRDAIAAABABZEMAgAAAEAFkQwC&#10;AAAAQAWRDAIAAABABcUmg5uHBs1OufEZS/Ibz2csqbzxNg8N1v98KWssyW88n7Ek//F88l02n/F8&#10;xuoEn+XzGUvyH88nn2XzGUsqdzzfsYI/H3zFCZQ5ns9Ykt94LrF6NKdv3OwIALAbn79fPUeWSpKO&#10;H7qn3v3pA7Prn1cODtU/o9gOPLFDS26MP1iiGHbv2Fr/fMOS4/XPs/vuldS8fQIA4sXWDAIAAAAA&#10;yodkEAAAAAAqiGQQAAAAACpoitkBANCexvuaUGxvvvkmywsAUFnUDAIAAABABZEMAkAGhkcOmZ0A&#10;5ITtDQCyQTNRAMjAXb96kaSJR90DyM8NSy4yOwEAUqBmEAAAAAAqiGQQAFJ69sVXzU4APGM7BID0&#10;aCYKACl97BNfMjuhyxx4YoeW3DhodgYAoBJ6NKdv3OwIALAbn7/f7ASgQHqOLDU7AQBCkAwCACqL&#10;mkEAQJVxzyAAAAAAVBDJIAAAAABUEMkgAAAAAFQQySAAAAAAVBDJIAAAAABUEMkgAAAAAFQQySAA&#10;AAAAVBDJIAAAAABUEMkgAAAAAFQQySAAAAAAVBDJIAAAAABUEMkgAAAAAFQQySAAAAAAVBDJIAAA&#10;AABUUGwyuHlo0OyUG5+xJL/xfMaSyhtv89Bg/c+XssaS/MbzGUsqdzyfsSS/8XzG6gSf5fMZS/Ib&#10;z2csyW88n7GkcsfzHSv488FXnECZ4/mMJfmN5xKrR3P6xs2OAABUwYEndmjJjfEHSwAAyii2ZhAA&#10;AAAAUD4kgwAAAABQQSSDAAAAAFBBJIMAAAAAUEEkgwAAAABQQSSDAAAAAFBBJIMAAAAAUEEkgwAA&#10;AABQQSSDAAAAAFBBJIMAAAAAUEEkgwAAAABQQSSDAAAAAFBBJIMAAAAAUEEkgwAAAABQQSSDAAAA&#10;AFBBJIMAAAAAUEEkgwAAAABQQSSDAAAAAFBBJIMAAAAAUEEkgwAAAABQQSSDAAAAAFBBJIMAAAAA&#10;UEEkgwAAAABQQSSDAAAAAFBBJIMAAAAAUEGxyeDmoUGzU258xpL8xvMZSypvvM1Dg/U/X8oaS/Ib&#10;z2csqdzxfMaS/MbzGasTfJbPZyzJbzyfsSS/8XzGksodz3es4M8HX3ECZY7nM5bkN55LrB7N6Rs3&#10;OwIAUAUHntihJTfGHywBACij2JpBAAAAAED5kAwCAAAAQAWRDAIAAABABZEMAgAAAEAFkQwCAAAA&#10;QAWRDAIAAABABZEMAgAAAEAFkQwCAAAAQAWRDAIAAABABZEMAgAAAEAFkQwCAAAAQAWRDAIAAABA&#10;BZEMAgAAAEAFkQwCAAAAQAWRDAIAAABABZEMAgAAAEAFkQwCAAAAQAWRDAIAAABABZEMAgAAAEAF&#10;kQwCAAAAQAWRDAIAAABABZEMAgAAAEAF/f8g1CtdNsidMAAAAABJRU5ErkJggg==&#10;"
       id="image1" />
    <g
       id="g10"
       transform="translate(5.2733924,12.033442)">
      <rect
         style="fill:#666666;stroke-width:0;stroke-linecap:round;stroke-linejoin:round;stroke-miterlimit:0"
         id="rect2-7-6-2"
         width="217.24886"
         height="39.902847"
         x="81.57309"
         y="19.706123"
         ry="13.300949" />
      <text
         xml:space="preserve"
         id="text1-31"
         style="font-size:29.3333px;line-height:1.25;font-family:'DejaVu Sans';-inkscape-font-specification:'DejaVu Sans, Normal';letter-spacing:0px;word-spacing:0px;white-space:pre;shape-inside:url(#rect1-78);display:inline;fill:#ffffff"
         transform="translate(-496.13158,-9.90884)"
         x="84.813057"
         y="0"><tspan
           x="598.99522"
           y="58.761689"
           id="tspan2"><tspan
             style="text-align:center;text-anchor:middle"
             id="tspan1">(-4.2, -2.05)</tspan></tspan></text>
    </g>
    <g
       id="g11"
       transform="translate(-137.09534,27.357582)">
      <rect
         style="fill:#666666;stroke-width:0;stroke-linecap:round;stroke-linejoin:round;stroke-miterlimit:0"
         id="rect2-7-6"
         width="217.24886"
         height="39.902847"
         x="732"
         y="370"
         ry="13.300949" />
      <text
         xml:space="preserve"
         id="text1-3"
         style="font-size:29.3333px;line-height:1.25;font-family:'DejaVu Sans';-inkscape-font-specification:'DejaVu Sans, Normal';letter-spacing:0px;word-spacing:0px;white-space:pre;shape-inside:url(#rect1-7);display:inline;fill:#ffffff"
         transform="translate(154.29532,340.38504)"
         x="83.559807"
         y="0"><tspan
           x="600.24847"
           y="58.761689"
           id="tspan4"><tspan
             style="text-align:center;text-anchor:middle"
             id="tspan3">(4.2, 11.45)</tspan></tspan></text>
    </g>
  </g>
</svg>
