{
    "name:": "KiCad 8.0.5-rc1",
    "output_prefix": "kicad-",
    "package_version": "8.0.5-rc1",
    "train": "stable",
    "build_mode": "Release",
    "nsis": {
        "file": "install.nsi"
    },
    "sources": {
        "kicad": {
            "ref": "tag/8.0.5-rc1"
        },
        "symbols": {
            "ref": "tag/8.0.5-rc1"
        },
        "footprints": {
            "ref": "tag/8.0.5-rc1"
        },
        "3dmodels": {
            "ref": "tag/8.0.5-rc1"
        },
        "templates": {
            "ref": "tag/8.0.5-rc1"
        }
    }, 
    "vcpkg": {
        "manifest_mode": true
    }
}