[
    {
        "relation": [
            "delegate_permission/common.handle_all_urls"
        ],
        "target": {
            "namespace": "android_app",
            "package_name": "com.finance.jfla",
            "sha256_cert_fingerprints": [
                "EE:11:3F:7D:5E:AE:0D:47:97:9E:C6:13:6C:C1:D8:76:5A:D8:00:86:FF:E6:AE:99:03:12:E7:63:98:5C:EC:29"
            ]
        }
    }
]